{"text_format":"1","workbook":"xlsx","n_sheets":4,"sheets":["Tool","Rules","List","Compatibility"],"not_rendered":{"charts":0,"images":2,"macros":1,"external_links":0,"defined_names":38,"comments":2,"pivot_tables":0},"unopened":[],"bounds":{"document_bytes":16777216,"sheet_cells":100000,"rows_first":2000,"rows_last":500,"rows_between":2000,"halvings":0,"cell_chars":16384,"cell_head_chars":4096},"cells_cut":0,"cells_raw":0,"read":"whole","date_system":"1900"}

{"sheet":"Tool","index":0,"n_rows":23,"n_cols":6,"rows_kept":23,"cut":false,"hidden":false,"merged":[[22,1,22,4],[1,1,2,5],[12,2,12,5],[13,2,13,5],[3,1,4,5],[5,1,5,2]]}
[]
[]
[]
[null,"SCM100ZS-W COMBINATION CHECK"]
[]
[null,"Select the number of indoor unit",null,"Type","Size","Model"]
[null,"Indoor unit 1","✔"]
[null,"Indoor unit 2","✔"]
[null,"Indoor unit 3","X"]
[null,"Indoor unit 4","X"]
[null,"Indoor unit 5","X"]
[]
[null,"Connected capacity",{"$f":"IF(COUNTIF(C7:C11,\"✔\")=COUNTA(E7:E11),IF(SUM(E7:E11)<90,CONCATENATE(SUM(E7:E11)/10,\" kW - Under lower limitation (9 kW)\"),IF(SUM(E7:E11)>160,CONCATENATE(SUM(E7:E11)/10,\" kW - Over upper limitation (16 kW)\"),CONCATENATE(SUM(E7:E11)/10,\" kW\"))),\"Finish indoor unit selection\")","v":"Finish indoor unit selection"}]
[null,"Combination limitation",{"$f":"IF($C$9=\"✔\",IF($C$11=\"✔\",IF(COUNTBLANK(F7:F11)>0,\"Finish indoor unit selection\",IF(COUNTIFS(D7:D11,\"SRK\",F7:F11,\"ZSX-W\")+COUNTIFS(D7:D11,\"SRF\",E7:E11,35)+COUNTIFS(D7:D11,\"SRF\",E7:E11,50)+COUNTIF(D7:D11,\"FDE\")>4,\"Not compatible\",IF(SUM(INDIRECT(\"_\"&$E$7),INDIRECT(\"_\"&$E$8),INDIRECT(\"_\"&$E$9),INDIRECT(\"_\"&$E$10),INDIRECT(\"_\"&$E$11))>6,\"Not compatible\",\"OK\"))),\"N/A\"),IF(COUNTA(D7:F8)=6,IF(OR($F$7=\"ZR-W\",$F$8=\"ZR-W\"),\"OK\",IF(AND(OR($D$7=\"SRK\",$D$8=\"SRK\"),$F$7=\"ZSX-W\",$F$8=\"ZSX-W\"),\"OK\",IF(AND(OR($D$7=\"FDE\",$D$8=\"FDE\"),OR($F$7=\"ZSX-W\",$F$8=\"ZSX-W\")),\"OK\",IF(OR(AND($D$7=\"SRK\",$F$7=\"ZSX-W\",$D$8=\"SRF\",$E$8=35),AND($D$8=\"SRK\",$F$8=\"ZSX-W\",$D$7=\"SRF\",$E$7=35)),\"OK\",\"Not compatible\")))),\"Finish indoor unit selection\"))","v":"Finish indoor unit selection"}]
[]
[null,"Help:"]
[null," 1. Select ✔ or X in column C to choose the number of indoor units"]
[null," 2. Select the type/size/model for each indoor unit marked with ✔"]
[null," 3. According to the number of indoor units, the criteria below must be checked"]
[null,"Number of connected indoor units",2,3,4,5]
[null,"Connected capacity (1)","Yes","Yes","Yes","Yes"]
[null,"Combination limitation (2)","Yes","No","No","Yes"]
[null,"(1) Connected capacity must be within 9.0 kW and 16kW\n(2) Refer to \"Rules\" sheet to learn more about combination limitation",null,null,null,"Ver1.0"]

{"sheet":"Rules","index":1,"n_rows":31,"n_cols":4,"rows_kept":31,"cut":false,"hidden":false,"merged":[[3,1,27,1],[3,2,8,2],[1,1,1,3],[2,2,2,3],[11,2,27,2]]}
[]
[null,"SCM100ZS-W - Combination limitation"]
[null,"Connected capacity","9.0 kW - 16.0 kW(1)"]
[null,"Number of connected indoor units ","2 Units"," Only the following combinations are possible(2)"]
[null,null,null,"• includes 1 or more SRK-ZR"]
[null,null,null,"• SRK-ZSX x 2"]
[null,null,null,"• SRK-ZSX + FDE50"]
[null,null,null,"• SRK-ZSX + SRF35,50"]
[null,null,null,"• FDE50 + SRF50"]
[null,null,"3 Units"," No limitation"]
[null,null,"4 Units"," No limitation"]
[null,null,"5 Units"," The following conditions A and B must be met:"]
[]
[null,null,null," A. The total number of (SRK-ZSX, SRF35,50, FDE50) is 4 or less(1)"]
[null,null,null," 5 units can be connected by connecting other indoor units."]
[null,null,null," Example:"]
[null,null,null," • SRK-ZS x4 + FDUM50 x1 is OK"]
[null,null,null," • SRK-ZSX x4 + SRK-ZS x1 is OK"]
[null,null,null," • SRK-ZSX x4 + FDE x1 is NOK"]
[]
[null,null,null," B. The following combinations are not possible."]
[]
[]
[]
[]
[]
[]
[]
[null,"Notes:"]
[null,"*1 to avoid insufficient heating capacity"]
[null,"*2 to avoid high pressure abnormality and low oil level"]

{"sheet":"List","index":2,"n_rows":23,"n_cols":38,"rows_kept":23,"cut":false,"hidden":true,"merged":[]}
["Model","SRK","SKM","SRF","SRR","FDTC","FDUM","FDE","SRK20","SRK25","SRK35","SRK50","SRK60","SRK71","SRK80","SKM20","SKM25","SKM35","SRF25","SRF35","SRF50","SRR25","SRR35","SRR50","SRR60","FDTC25","FDTC35","FDTC50","FDTC60","FDUM50","FDE50","20","25","35","50","60","71","80"]
["SRK",20,20,25,25,25,50,50,"ZSX-W","ZSX-W","ZSX-W","ZSX-W","ZSX-W","ZR-W","ZR-W","ZSP-W","ZSP-W","ZSP-W","ZS-W","ZS-W","ZSX-W","ZS-W","ZS-W","ZS-W","ZS-W","VH","VH","VH","VH","VH","VH",1,1,1,2,2,3,3]
["SKM",25,25,35,35,35,null,null,"ZS-W","ZS-W","ZS-W","ZS-W",null,null,null,null,null,null,null,null,null,"ZM-W","ZM-W",null,null,"VH1","VH1"]
["SRF",35,35,50,50,50]
["SRR",50,null,null,60,60]
["FDTC",60]
["FDUM",71]
["FDE",80]
[]
[null,null,"Connectable capacity"]
["✔",null,"=IF(SUM(E5:E9)<90,\"Under lower limitation (90)\",IF(SUM(E5:E9)>160,\"Over upper limitation (160)\",\"OK\"))"]
["X"]
[null,null,"In case of 2 rooms:"]
[null,null,"Condition 1","=IF(OR($F$5=\"ZR-W\",$F$6=\"ZR-W\"),\"OK\",\"NOK\")"]
[null,null,"Condition 2","=IF(AND(OR($D$5=\"SRK\",$D$6=\"SRK\"),$F$5=\"ZSX-W\",$F$6=\"ZSX-W\"),\"OK\",\"NOK\")"]
[null,null,"Condition 3","=IF(AND(OR($D$5=\"FDE\",$D$6=\"FDE\"),OR($F$5=\"ZSX-W\",$F$6=\"ZSX-W\")),\"OK\",\"NOK\")"]
[null,null,"Condition 4","=IF(OR(AND($D$5=\"SRK\",$F$5=\"ZSX-W\",$D$6=\"SRF\",$E$6=35),AND($D$6=\"SRK\",$F$6=\"ZSX-W\",$D$5=\"SRF\",$E$5=35)),\"OK\",\"NOK\")"]
[null,null,"Condition 5","see condition 3"]
[null,null,"Combined","=IF($C$7=\"✔\",\"NA\",IF(OR($F$5=\"ZR-W\",$F$6=\"ZR-W\"),\"OK\",IF(AND(OR($D$5=\"SRK\",$D$6=\"SRK\"),$F$5=\"ZSX-W\",$F$6=\"ZSX-W\"),\"OK\",IF(AND(OR($D$5=\"FDE\",$D$6=\"FDE\"),OR($F$5=\"ZSX-W\",$F$6=\"ZSX-W\")),\"OK\",IF(OR(AND($D$5=\"SRK\",$F$5=\"ZSX-W\",$D$6=\"SRF\",$E$6=35),AND($D$6=\"SRK\",$F$6=\"ZSX-W\",$D$5=\"SRF\",$E$5=35)),\"OK\",\"Not compatible\")))))"]
[]
[null,null,"In case of 5 rooms:"]
[null,null,"Condition A","=IF(COUNTIFS(D7:D11,\"SRK\",F7:F11,\"ZSX-W\")+COUNTIFS(D7:D11,\"SRF\",E7:E11,35)+COUNTIFS(D7:D11,\"SRF\",E7:E11,50)+COUNTIF(D7:D11,\"FDE\")>4,\"Not compatible\",\"OK\")"]
[null,null,"Condition B","=IF(SUM(INDIRECT(\"_\"&$E$7),INDIRECT(\"_\"&$E$8),INDIRECT(\"_\"&$E$9),INDIRECT(\"_\"&$E$10),INDIRECT(\"_\"&$E$11))>6,\"Not compatible\",\"OK\")"]

{"sheet":"Compatibility","index":3,"n_rows":433,"n_cols":38,"rows_kept":433,"cut":false,"hidden":true,"merged":[[3,11,3,15],[3,18,3,21],[3,25,3,28]]}
["Table of Indoor unit combination　ＳＣＭ１００ＺS－W"]
[null,null,null,null,null,null,null,null,null,null,null,null,null,null,null,null,null,null,null,null,null,null,null,null,null,null,null,null,null,null,null,null,null,null,null,null,null,"✔: Possible to connect"]
[]
["Indoor unit combination",null,null,null,null,null,null,null,null,null,"Total ","SRK-ZSX-W",null,null,null,null,"SRK-ZR-W",null,"SRK-ZS-W",null,null,null,"SKM-ZSP-W",null,null,"SRR-ZS-W",null,null,null,"SRF-ZS(X)-W",null,null,"FDTC",null,null,null,"FDUM","FDE"]
[null,null,null,null,null,null,null,null,null,null,"Connected capacity",20,25,35,50,60,71,80,20,25,35,50,20,25,35,25,35,50,60,25,35,50,25,35,50,60,50,50]
[2,20,"+",20,null,null,null,null,null,null,{"$f":"IF(SUM(B6,D6,F6,H6,J6)<90,\"Under lower limitation\",IF(SUM(B6,D6,F6,H6,J6)>160,\"Over upper limitation\",SUM(B6,D6,F6,H6,J6)))","v":"Under lower limitation"},{"$f":"IF(OR($K6=\"Under lower limitation\",$K6=\"Over upper limitation\"),\"\",IF(COUNTIF($B6:$J6,L$5),\"✔\",\"\"))","v":""},{"$f":"IF(OR($K6=\"Under lower limitation\",$K6=\"Over upper limitation\"),\"\",IF(COUNTIF($B6:$J6,M$5),\"✔\",\"\"))","v":""},"","","","","","","","","","","","","","","",{"$f":"IF(OR($K6=\"Under lower limitation\",$K6=\"Over upper limitation\"),\"\",IF(COUNTIF($B6:$J6,AC$5),\"✔\",\"\"))","v":""},"","","","","","","","",""]
[null,20,"+",25,null,null,null,null,null,null,{"$f":"IF(SUM(B7,D7,F7,H7,J7)<90,\"Under lower limitation\",IF(SUM(B7,D7,F7,H7,J7)>160,\"Over upper limitation\",SUM(B7,D7,F7,H7,J7)))","v":"Under lower limitation"},{"$f":"IF(OR($K7=\"Under lower limitation\",$K7=\"Over upper limitation\"),\"\",IF(COUNTIF($B7:$J7,L$5),\"✔\",\"\"))","v":""},"","","","","","","","","","","","","","","","","","","","","","","","","",""]
[null,20,"+",35,null,null,null,null,null,null,"Under lower limitation","","","","","","","","","","","","","","","","","","","","","","","","","","",""]
[null,20,"+",50,null,null,null,null,null,null,"Under lower limitation","","","","","","","","","","","","","","","","","","","","","","","","","","",""]
[null,20,"+",60,null,null,null,null,null,null,"Under lower limitation","","","","","","","","","","","","","","","","","","","","","","","","","","",""]
[null,20,"+",71,null,null,null,null,null,null,91,"✔","","","","","✔","","✔","","","","✔","","","","","","","","","","","","","","",""]
[null,20,"+",80,null,null,null,null,null,null,100,"✔","","","","","","✔","✔","","","","✔","","","","","","","","","","","","","","",""]
[null,25,"+",25,null,null,null,null,null,null,"Under lower limitation","","","","","","","","","","","","","","","","","","","","","","","","","","",""]
[null,25,"+",35,null,null,null,null,null,null,"Under lower limitation","","","","","","","","","","","","","","","","","","","","","","","","","","",""]
[null,25,"+",50,null,null,null,null,null,null,"Under lower limitation","","","","","","","","","","","","","","","","","","","","","","","","","","",""]
[null,25,"+",60,null,null,null,null,null,null,"Under lower limitation","","","","","","","","","","","","","","","","","","","","","","","","","","",""]
[null,25,"+",71,null,null,null,null,null,null,96,"","✔","","","","✔","","","✔","","","","✔","","✔","","","","✔","","","✔","","","","",""]
[null,25,"+",80,null,null,null,null,null,null,105,"","✔","","","","","✔","","✔","","","","✔","","✔","","","","✔","","","✔","","","","",""]
[null,35,"+",35,null,null,null,null,null,null,"Under lower limitation","","","","","","","","","","","","","","","","","","","","","","","","","","",""]
[null,35,"+",50,null,null,null,null,null,null,"Under lower limitation","","","","","","","","","","","","","","","","","","","","","","","","","","",""]
[null,35,"+",60,null,null,null,null,null,null,95,"","","✔","","✔","","","","","✔","","","","✔","","✔",{"$f":"IF(OR($K21=\"Under lower limitation\",$K21=\"Over upper limitation\"),\"\",IF(COUNTIF($B21:$J21,AB$5),\"✔\",\"\"))","v":""},"✔","","✔","","","✔","","✔","",""]
[null,35,"+",71,null,null,null,null,null,null,106,"","","✔","","","✔","","","","✔","","","","✔","","✔","","","","✔","","","✔","","","",""]
[null,35,"+",80,null,null,null,null,null,null,115,{"$f":"IF(OR($K23=\"Under lower limitation\",$K23=\"Over upper limitation\"),\"\",IF(COUNTIF($B23:$J23,L$5),\"✔\",\"\"))","v":""},"","✔","","","","✔","","","✔","","","","✔","","✔","","","","✔","","","✔","","","",""]
[null,50,"+",50,null,null,null,null,null,null,100,"","","","✔","","","","","","","✔","","","","","","✔","","","","✔","","","✔","","✔","✔"]
[null,50,"+",60,null,null,null,null,null,null,110,"","","","✔","✔","","","","","","✔","","","","","","✔","✔","","","✔","","","✔","✔","✔","✔"]
[null,50,"+",71,null,null,null,null,null,null,121,"","","","✔","","✔","","","","","✔","","","","","","✔","","","","✔","","","✔","","✔","✔"]
[null,50,"+",80,null,null,null,null,null,null,130,"","","","✔","","","✔","","","","✔","","","","","","✔","","","","✔","","","✔","","✔","✔"]
[null,60,"+",60,null,null,null,null,null,null,120,"","","","","✔","","","","","","","","","","","","","✔","","","","","","","✔","",""]
[null,60,"+",71,null,null,null,null,null,null,131,"","","","","✔","✔","","","","","","","","","","","","✔","","","","","","","✔","",""]
[null,60,"+",80,null,null,null,null,null,null,140,"","","","","✔","","✔","","","","","","","","","","","✔","","","","","","","✔","",""]
[null,71,"+",71,null,null,null,null,null,null,142,"","","","","","✔","","","","","","","","","","","","","","","","","","","","",""]
[null,71,"+",80,null,null,null,null,null,null,151,"","","","","","✔","✔","","","","","","","","","","","","","","","","","","","",""]
[null,80,"+",80,null,null,null,null,null,null,160,"","","","","","","✔","","","","","","","","","","","","","","","","","","","",""]
[3,20,"+",20,"+",20,null,null,null,null,"Under lower limitation","","","","","","","","","","","","","","","","","","","","","","","","","","",""]
[null,20,"+",20,"+",25,null,null,null,null,"Under lower limitation",{"$f":"IF(OR($K35=\"Under lower limitation\",$K35=\"Over upper limitation\"),\"\",IF(COUNTIF($B35:$J35,L$5),\"✔\",\"\"))","v":""},"","","","","","","","","","","","","","","","","","","","","","","","","",""]
[null,20,"+",20,"+",35,null,null,null,null,"Under lower limitation","","","","","","","","","","","","","","","","","","","","","","","","","","",""]
[null,20,"+",20,"+",50,null,null,null,null,90,"✔","","","✔","","","","✔","","","✔","✔","","","","","✔","","","","✔","","","✔","","✔","✔"]
[null,20,"+",20,"+",60,null,null,null,null,100,"✔","","","","✔","","","✔","","","","✔","","","","","","✔","","","","","","","✔","",""]
[null,20,"+",20,"+",71,null,null,null,null,111,"✔","","","","","✔","","✔","","","","✔","","","","","","","","","","","","","","",""]
[null,20,"+",20,"+",80,null,null,null,null,120,"✔","","","","","","✔","✔","","","","✔","","","","","","","","","","","","","","",""]
[null,20,"+",25,"+",25,null,null,null,null,"Under lower limitation",{"$f":"IF(OR($K41=\"Under lower limitation\",$K41=\"Over upper limitation\"),\"\",IF(COUNTIF($B41:$J41,L$5),\"✔\",\"\"))","v":""},"","","","","","","","","","","","","","","","","","","","","","","","","",""]
[null,20,"+",25,"+",35,null,null,null,null,"Under lower limitation","","","","","","","","","","","","","","","","","","","","","","","","","","",""]
[null,20,"+",25,"+",50,null,null,null,null,95,"✔","✔","","✔","","","","✔","✔","","✔","✔","✔","","✔","","✔","","✔","","✔","✔","","✔","","✔","✔"]
[null,20,"+",25,"+",60,null,null,null,null,105,"✔","✔","","","✔","","","✔","✔","","","✔","✔","","✔","","","✔","✔","","","✔","","","✔","",""]
[null,20,"+",25,"+",71,null,null,null,null,116,"✔","✔","","","","✔","","✔","✔","","","✔","✔","","✔","","","","✔","","","✔","","","","",""]
[null,20,"+",25,"+",80,null,null,null,null,125,"✔","✔","","","","","✔","✔","✔","","","✔",{"$f":"IF(OR($K46=\"Under lower limitation\",$K46=\"Over upper limitation\"),\"\",IF(COUNTIF($B46:$J46,X$5),\"✔\",\"\"))","v":"✔"},"","✔","","","","✔","","","✔","","","","",""]
[null,20,"+",35,"+",35,null,null,null,null,90,{"$f":"IF(OR($K47=\"Under lower limitation\",$K47=\"Over upper limitation\"),\"\",IF(COUNTIF($B47:$J47,L$5),\"✔\",\"\"))","v":"✔"},"","✔","","","","","✔","","✔","","✔","","✔","","✔","","","","✔","","","✔","","","",""]
[null,20,"+",35,"+",50,null,null,null,null,105,"✔","","✔","✔","","","","✔","","✔","✔","✔","","✔","","✔","✔","","","✔","✔","","✔","✔","","✔","✔"]
[null,20,"+",35,"+",60,null,null,null,null,115,"✔","","✔","","✔","","","✔","","✔","","✔","","✔","","✔","","✔","","✔","","","✔","","✔","",""]
[null,20,"+",35,"+",71,null,null,null,null,126,"✔","","✔","","","✔","","✔","","✔","","✔","","✔","","✔","","","","✔","","","✔","","","",""]
[null,20,"+",35,"+",80,null,null,null,null,135,"✔","","✔","","","","✔","✔","","✔","","✔","","✔","","✔","","","","✔","","","✔","","","",""]
[null,20,"+",50,"+",50,null,null,null,null,120,"✔","","","✔","","","","✔","","","✔","✔","","","","","✔","","","","✔","","","✔","","✔","✔"]
[null,20,"+",50,"+",60,null,null,null,null,130,"✔","","","✔","✔","","","✔","","","✔","✔","","","","","✔","✔","","","✔","","","✔","✔","✔","✔"]
[null,20,"+",50,"+",71,null,null,null,null,141,"✔","","","✔","","✔","","✔","","","✔","✔","","","","","✔","","","","✔","","","✔","","✔","✔"]
[null,20,"+",50,"+",80,null,null,null,null,150,"✔","","","✔","","","✔","✔","","","✔","✔","","","","","✔","","","","✔","","","✔","","✔","✔"]
[null,20,"+",60,"+",60,null,null,null,null,140,"✔","","","","✔","","","✔","","","","✔",{"$f":"IF(OR($K56=\"Under lower limitation\",$K56=\"Over upper limitation\"),\"\",IF(COUNTIF($B56:$J56,X$5),\"✔\",\"\"))","v":""},"","","","","✔","","","","","","","✔","",""]
[null,20,"+",60,"+",71,null,null,null,null,151,{"$f":"IF(OR($K57=\"Under lower limitation\",$K57=\"Over upper limitation\"),\"\",IF(COUNTIF($B57:$J57,L$5),\"✔\",\"\"))","v":"✔"},"","","","✔","✔","","✔","","","","✔","","","","","","✔","","","","","","","✔","",""]
[null,20,"+",60,"+",80,null,null,null,null,160,"✔","","","","✔","","✔","✔","","","","✔","","","","","","✔","","","","","","","✔","",""]
[null,20,"+",71,"+",71,null,null,null,null,"Over upper limitation",{"$f":"IF(OR($K59=\"Under lower limitation\",$K59=\"Over upper limitation\"),\"\",IF(COUNTIF($B59:$J59,L$5),\"✔\",\"\"))","v":""},"","","","","","","","","","","","","","","","","","","","","","","","","",""]
[null,20,"+",71,"+",80,null,null,null,null,"Over upper limitation","","","","","","","","","","","","","","","","","","","","","","","","","","",""]
[null,20,"+",80,"+",80,null,null,null,null,{"$f":"IF(SUM(B61,D61,F61,H61,J61)<90,\"Under lower limitation\",IF(SUM(B61,D61,F61,H61,J61)>160,\"Over upper limitation\",SUM(B61,D61,F61,H61,J61)))","v":"Over upper limitation"},"","","","","","","","","","","","","","","","","","","","","","","","","","",""]
[null,25,"+",25,"+",25,null,null,null,null,{"$f":"IF(SUM(B62,D62,F62,H62,J62)<90,\"Under lower limitation\",IF(SUM(B62,D62,F62,H62,J62)>160,\"Over upper limitation\",SUM(B62,D62,F62,H62,J62)))","v":"Under lower limitation"},"","","","","","","","","","","","","","","","","","","","","","","","","","",""]
[null,25,"+",25,"+",35,null,null,null,null,"Under lower limitation","","","","","","","","","","","","","","","","","","","","","","","","","","",""]
[null,25,"+",25,"+",50,null,null,null,null,100,"","✔","","✔","","","","","✔","","✔","","✔","","✔","","✔","","✔","","✔","✔","","✔","","✔","✔"]
[null,25,"+",25,"+",60,null,null,null,null,110,"","✔","","","✔","","","","✔","","","","✔","","✔","","","✔","✔","","","✔","","","✔","",""]
[null,25,"+",25,"+",71,null,null,null,null,121,"","✔","","","","✔","","","✔","","","","✔","","✔","","","","✔","","","✔","","","","",""]
[null,25,"+",25,"+",80,null,null,null,null,130,"","✔","","","","","✔","","✔","","","","✔","","✔","","","","✔","","","✔","","","","",""]
[null,25,"+",35,"+",35,null,null,null,null,95,"","✔","✔","","","","","","✔","✔","","","✔","✔","✔","✔","","","✔","✔","","✔","✔","","","",""]
[null,25,"+",35,"+",50,null,null,null,null,110,"","✔","✔","✔","","","","","✔","✔","✔","","✔","✔","✔","✔","✔","","✔","✔","✔","✔","✔","✔","","✔","✔"]
[null,25,"+",35,"+",60,null,null,null,null,120,"","✔","✔","","✔","","","","✔","✔","","","✔","✔","✔","✔","","✔","✔","✔","","✔","✔","","✔","",""]
[null,25,"+",35,"+",71,null,null,null,null,131,"","✔","✔","","","✔","","","✔","✔","","",{"$f":"IF(OR($K71=\"Under lower limitation\",$K71=\"Over upper limitation\"),\"\",IF(COUNTIF($B71:$J71,X$5),\"✔\",\"\"))","v":"✔"},"✔","✔","✔","","","✔","✔","","✔","✔","","","",""]
[null,25,"+",35,"+",80,null,null,null,null,140,{"$f":"IF(OR($K72=\"Under lower limitation\",$K72=\"Over upper limitation\"),\"\",IF(COUNTIF($B72:$J72,L$5),\"✔\",\"\"))","v":""},"✔","✔","","","","✔","","✔","✔","","","✔","✔","✔","✔","","","✔","✔","","✔","✔","","","",""]
[null,25,"+",50,"+",50,null,null,null,null,125,"","✔","","✔","","","","","✔","","✔","","✔","","✔","","✔","","✔","","✔","✔","","✔","","✔","✔"]
[null,25,"+",50,"+",60,null,null,null,null,135,"","✔","","✔","✔","","","","✔","","✔","","✔","","✔","","✔","✔","✔","","✔","✔","","✔","✔","✔","✔"]
[null,25,"+",50,"+",71,null,null,null,null,{"$f":"IF(SUM(B75,D75,F75,H75,J75)<90,\"Under lower limitation\",IF(SUM(B75,D75,F75,H75,J75)>160,\"Over upper limitation\",SUM(B75,D75,F75,H75,J75)))","v":146},"","✔","","✔","","✔","","","✔","","✔","","✔","","✔","","✔","","✔","","✔","✔","","✔","","✔","✔"]
[null,25,"+",50,"+",80,null,null,null,null,155,"","✔","","✔","","","✔","","✔","","✔","","✔","","✔","","✔","","✔","","✔","✔","","✔","","✔","✔"]
[null,25,"+",60,"+",60,null,null,null,null,145,"","✔","","","✔","","","","✔","","","","✔","","✔","","","✔","✔","","","✔","","","✔","",""]
[null,25,"+",60,"+",71,null,null,null,null,156,"","✔","","","✔","✔","","","✔","","","","✔","","✔","","","✔","✔","","","✔","","","✔","",""]
[null,25,"+",60,"+",80,null,null,null,null,{"$f":"IF(SUM(B79,D79,F79,H79,J79)<90,\"Under lower limitation\",IF(SUM(B79,D79,F79,H79,J79)>160,\"Over upper limitation\",SUM(B79,D79,F79,H79,J79)))","v":"Over upper limitation"},{"$f":"IF(OR($K79=\"Under lower limitation\",$K79=\"Over upper limitation\"),\"\",IF(COUNTIF($B79:$J79,L$5),\"✔\",\"\"))","v":""},"","","","","","","","","","","","","","","","","","","","","","","","","",""]
[null,25,"+",71,"+",71,null,null,null,null,"Over upper limitation","","","","","","","","","","","","","","","","","","","","","","","","","","",""]
[null,25,"+",71,"+",80,null,null,null,null,{"$f":"IF(SUM(B81,D81,F81,H81,J81)<90,\"Under lower limitation\",IF(SUM(B81,D81,F81,H81,J81)>160,\"Over upper limitation\",SUM(B81,D81,F81,H81,J81)))","v":"Over upper limitation"},"","","","","","","","","","","","","","","","","","","","","","","","","","",""]
[null,25,"+",80,"+",80,null,null,null,null,{"$f":"IF(SUM(B82,D82,F82,H82,J82)<90,\"Under lower limitation\",IF(SUM(B82,D82,F82,H82,J82)>160,\"Over upper limitation\",SUM(B82,D82,F82,H82,J82)))","v":"Over upper limitation"},"","","","","","","","","","","","","","","","","","","","","","","","","","",""]
[null,35,"+",35,"+",35,null,null,null,null,105,"","","✔","","","","","","","✔","","","","✔","","✔","","","","✔","","","✔","","","",""]
[null,35,"+",35,"+",50,null,null,null,null,120,"","","✔","✔","","","","","","✔","✔","","","✔","","✔","✔","","","✔","✔","","✔","✔","","✔","✔"]
[null,35,"+",35,"+",60,null,null,null,null,130,"","","✔","","✔","","","","","✔","","",{"$f":"IF(OR($K85=\"Under lower limitation\",$K85=\"Over upper limitation\"),\"\",IF(COUNTIF($B85:$J85,X$5),\"✔\",\"\"))","v":""},"✔","","✔","","✔","","✔","","","✔","","✔","",""]
[null,35,"+",35,"+",71,null,null,null,null,141,{"$f":"IF(OR($K86=\"Under lower limitation\",$K86=\"Over upper limitation\"),\"\",IF(COUNTIF($B86:$J86,L$5),\"✔\",\"\"))","v":""},"","✔","","","✔","","","","✔","","","","✔","","✔","","","","✔","","","✔","","","",""]
[null,35,"+",35,"+",80,null,null,null,null,150,"","","✔","","","","✔","","","✔","","","","✔","","✔","","","","✔","","","✔","","","",""]
[null,35,"+",50,"+",50,null,null,null,null,135,"","","✔","✔","","","","","","✔","✔","","","✔","","✔","✔","","","✔","✔","","✔","✔","","✔","✔"]
[null,35,"+",50,"+",60,null,null,null,null,145,"","","✔","✔","✔","","","","","✔","✔","","","✔","","✔","✔","✔","","✔","✔","","✔","✔","✔","✔","✔"]
[null,35,"+",50,"+",71,null,null,null,null,156,"","","✔","✔","","✔","","","","✔","✔","","","✔","","✔","✔","","","✔","✔","","✔","✔","","✔","✔"]
[null,35,"+",50,"+",80,null,null,null,null,{"$f":"IF(SUM(B91,D91,F91,H91,J91)<90,\"Under lower limitation\",IF(SUM(B91,D91,F91,H91,J91)>160,\"Over upper limitation\",SUM(B91,D91,F91,H91,J91)))","v":"Over upper limitation"},{"$f":"IF(OR($K91=\"Under lower limitation\",$K91=\"Over upper limitation\"),\"\",IF(COUNTIF($B91:$J91,L$5),\"✔\",\"\"))","v":""},"","","","","","","","","","","","","","","","","","","","","","","","","",""]
[null,35,"+",60,"+",60,null,null,null,null,155,"","","✔","","✔","","","","","✔","","","","✔","","✔","","✔","","✔","","","✔","","✔","",""]
[null,35,"+",60,"+",71,null,null,null,null,"Over upper limitation",{"$f":"IF(OR($K93=\"Under lower limitation\",$K93=\"Over upper limitation\"),\"\",IF(COUNTIF($B93:$J93,L$5),\"✔\",\"\"))","v":""},"","","","","","","","","","","","","","","","","","","","","","","","","",""]
[null,35,"+",60,"+",80,null,null,null,null,{"$f":"IF(SUM(B94,D94,F94,H94,J94)<90,\"Under lower limitation\",IF(SUM(B94,D94,F94,H94,J94)>160,\"Over upper limitation\",SUM(B94,D94,F94,H94,J94)))","v":"Over upper limitation"},"","","","","","","","","","","","","","","","","","","","","","","","","","",""]
[null,35,"+",71,"+",71,null,null,null,null,{"$f":"IF(SUM(B95,D95,F95,H95,J95)<90,\"Under lower limitation\",IF(SUM(B95,D95,F95,H95,J95)>160,\"Over upper limitation\",SUM(B95,D95,F95,H95,J95)))","v":"Over upper limitation"},"","","","","","","","","","","","","","","","","","","","","","","","","","",""]
[null,35,"+",71,"+",80,null,null,null,null,"Over upper limitation","","","","","","","","","","","","","","","","","","","","","","","","","","",""]
[null,35,"+",80,"+",80,null,null,null,null,{"$f":"IF(SUM(B97,D97,F97,H97,J97)<90,\"Under lower limitation\",IF(SUM(B97,D97,F97,H97,J97)>160,\"Over upper limitation\",SUM(B97,D97,F97,H97,J97)))","v":"Over upper limitation"},"","","","","","","","","","","","","","","","","","","","","","","","","","",""]
[null,50,"+",50,"+",50,null,null,null,null,150,"","","","✔","","","","","","","✔","","","","","","✔","","","","✔","","","✔","","✔","✔"]
[null,50,"+",50,"+",60,null,null,null,null,160,"","","","✔","✔","","","","","","✔","","","","","","✔","✔","","","✔","","","✔","✔","✔","✔"]
[null,50,"+",50,"+",71,null,null,null,null,{"$f":"IF(SUM(B100,D100,F100,H100,J100)<90,\"Under lower limitation\",IF(SUM(B100,D100,F100,H100,J100)>160,\"Over upper limitation\",SUM(B100,D100,F100,H100,J100)))","v":"Over upper limitation"},{"$f":"IF(OR($K100=\"Under lower limitation\",$K100=\"Over upper limitation\"),\"\",IF(COUNTIF($B100:$J100,L$5),\"✔\",\"\"))","v":""},"","","","","","","","","","","","","","","","","","","","","","","","","",""]
[null,50,"+",50,"+",80,null,null,null,null,"Over upper limitation","","","","","","","","","","","","","","","","","","","","","","","","","","",""]
[null,50,"+",60,"+",60,null,null,null,null,"Over upper limitation","","","","","","","","","","","","","","","","","","","","","","","","","","",""]
[null,50,"+",60,"+",71,null,null,null,null,"Over upper limitation","","","","","","","","","","","","","","","","","","","","","","","","","","",""]
[null,50,"+",60,"+",80,null,null,null,null,{"$f":"IF(SUM(B104,D104,F104,H104,J104)<90,\"Under lower limitation\",IF(SUM(B104,D104,F104,H104,J104)>160,\"Over upper limitation\",SUM(B104,D104,F104,H104,J104)))","v":"Over upper limitation"},"","","","","","","","","","","","","","","","","","","","","","","","","","",""]
[null,50,"+",71,"+",71,null,null,null,null,"Over upper limitation","","","","","","","","","","","","","","","","","","","","","","","","","","",""]
[null,50,"+",71,"+",80,null,null,null,null,{"$f":"IF(SUM(B106,D106,F106,H106,J106)<90,\"Under lower limitation\",IF(SUM(B106,D106,F106,H106,J106)>160,\"Over upper limitation\",SUM(B106,D106,F106,H106,J106)))","v":"Over upper limitation"},"","","","","","","","","","","","","","","","","","","","","","","","","","",""]
[null,50,"+",80,"+",80,null,null,null,null,"Over upper limitation","","","","","","","","","","","","","","","","","","","","","","","","","","",""]
[null,60,"+",60,"+",60,null,null,null,null,"Over upper limitation","","","","","","","","","","","","","","","","","","","","","","","","","","",""]
[null,60,"+",60,"+",71,null,null,null,null,"Over upper limitation","","","","","","","","","","","","",{"$f":"IF(OR($K109=\"Under lower limitation\",$K109=\"Over upper limitation\"),\"\",IF(COUNTIF($B109:$J109,X$5),\"✔\",\"\"))","v":""},"","","","","","","","","","","","","",""]
[null,60,"+",60,"+",80,null,null,null,null,"Over upper limitation",{"$f":"IF(OR($K110=\"Under lower limitation\",$K110=\"Over upper limitation\"),\"\",IF(COUNTIF($B110:$J110,L$5),\"✔\",\"\"))","v":""},"","","","","","","","","","","","","","","","","","","","","","","","","",""]
[null,60,"+",71,"+",71,null,null,null,null,"Over upper limitation","","","","","","","","","","","","","","","","","","","","","","","","","","",""]
[null,60,"+",71,"+",80,null,null,null,null,"Over upper limitation","","","","","","","","","","","","","","","","","","","","","","","","","","",""]
[null,60,"+",80,"+",80,null,null,null,null,{"$f":"IF(SUM(B113,D113,F113,H113,J113)<90,\"Under lower limitation\",IF(SUM(B113,D113,F113,H113,J113)>160,\"Over upper limitation\",SUM(B113,D113,F113,H113,J113)))","v":"Over upper limitation"},"","","","","","","","","","","","","","","","","","","","","","","","","","",""]
[null,71,"+",71,"+",71,null,null,null,null,"Over upper limitation","","","","","","","","","","","","","","","","","","","","","","","","","","",""]
[null,71,"+",71,"+",80,null,null,null,null,{"$f":"IF(SUM(B115,D115,F115,H115,J115)<90,\"Under lower limitation\",IF(SUM(B115,D115,F115,H115,J115)>160,\"Over upper limitation\",SUM(B115,D115,F115,H115,J115)))","v":"Over upper limitation"},"","","","","","","","","","","","","","","","","","","","","","","","","","",""]
[null,71,"+",80,"+",80,null,null,null,null,{"$f":"IF(SUM(B116,D116,F116,H116,J116)<90,\"Under lower limitation\",IF(SUM(B116,D116,F116,H116,J116)>160,\"Over upper limitation\",SUM(B116,D116,F116,H116,J116)))","v":"Over upper limitation"},"","","","","","","","","","","","","","","","","","","","","","","","","","",""]
[null,80,"+",80,"+",80,null,null,null,null,"Over upper limitation","","","","","","","","","","","","","","","","","","","","","","","","","","",""]
[4,20,"+",20,"+",20,"+",20,null,null,"Under lower limitation","","","","","","","","","","","","",{"$f":"IF(OR($K118=\"Under lower limitation\",$K118=\"Over upper limitation\"),\"\",IF(COUNTIF($B118:$J118,X$5),\"✔\",\"\"))","v":""},"","","","","","","","","","","","","",""]
[null,20,"+",20,"+",20,"+",25,null,null,"Under lower limitation",{"$f":"IF(OR($K119=\"Under lower limitation\",$K119=\"Over upper limitation\"),\"\",IF(COUNTIF($B119:$J119,L$5),\"✔\",\"\"))","v":""},"","","","","","","","","","","","","","","","","","","","","","","","","",""]
[null,20,"+",20,"+",20,"+",35,null,null,95,"✔","","✔","","","","","✔","","✔","","✔","","✔","","✔","","","","✔","","","✔","","","",""]
[null,20,"+",20,"+",20,"+",50,null,null,110,"✔","","","✔","","","","✔","","","✔","✔","","","","","✔","","","","✔","","","✔","","✔","✔"]
[null,20,"+",20,"+",20,"+",60,null,null,120,"✔","","","","✔","","","✔","","","","✔","","","","","","✔","","","","","","","✔","",""]
[null,20,"+",20,"+",20,"+",71,null,null,131,"✔","","","","","✔","","✔","","","","✔","","","","","","","","","","","","","","",""]
[null,20,"+",20,"+",20,"+",80,null,null,140,"✔","","","","","","✔","✔","","","","✔","","","","","","","","","","","","","","",""]
[null,20,"+",20,"+",25,"+",25,null,null,90,"✔","✔","","","","","","✔","✔","","","✔","✔","","✔","","","","✔","","","✔","","","","",""]
[null,20,"+",20,"+",25,"+",35,null,null,100,"✔","✔","✔","","","","","✔","✔","✔","","✔","✔","✔","✔","✔","","","✔","✔","","✔","✔","","","",""]
[null,20,"+",20,"+",25,"+",50,null,null,115,"✔","✔","","✔","","","","✔","✔","","✔","✔","✔","","✔","","✔","","✔","","✔","✔","","✔","","✔","✔"]
[null,20,"+",20,"+",25,"+",60,null,null,125,"✔","✔","","","✔","","","✔","✔","","","✔",{"$f":"IF(OR($K128=\"Under lower limitation\",$K128=\"Over upper limitation\"),\"\",IF(COUNTIF($B128:$J128,X$5),\"✔\",\"\"))","v":"✔"},"","✔","","","✔","✔","","","✔","","","✔","",""]
[null,20,"+",20,"+",25,"+",71,null,null,136,{"$f":"IF(OR($K129=\"Under lower limitation\",$K129=\"Over upper limitation\"),\"\",IF(COUNTIF($B129:$J129,L$5),\"✔\",\"\"))","v":"✔"},"✔","","","","✔","","✔","✔","","","✔","✔","","✔","","","","✔","","","✔","","","","",""]
[null,20,"+",20,"+",25,"+",80,null,null,145,"✔","✔","","","","","✔","✔","✔","","","✔","✔","","✔","","","","✔","","","✔","","","","",""]
[null,20,"+",20,"+",35,"+",35,null,null,110,"✔","","✔","","","","","✔","","✔","","✔","","✔","","✔","","","","✔","","","✔","","","",""]
[null,20,"+",20,"+",35,"+",50,null,null,125,"✔","","✔","✔","","","","✔","","✔","✔","✔","","✔","","✔","✔","","","✔","✔","","✔","✔","","✔","✔"]
[null,20,"+",20,"+",35,"+",60,null,null,135,"✔","","✔","","✔","","","✔","","✔","","✔","","✔","","✔","","✔","","✔","","","✔","","✔","",""]
[null,20,"+",20,"+",35,"+",71,null,null,146,"✔","","✔","","","✔","","✔","","✔","","✔","","✔","","✔","","","","✔","","","✔","","","",""]
[null,20,"+",20,"+",35,"+",80,null,null,155,"✔","","✔","","","","✔","✔","","✔","","✔","","✔","","✔","","","","✔","","","✔","","","",""]
[null,20,"+",20,"+",50,"+",50,null,null,140,"✔","","","✔","","","","✔","","","✔","✔","","","","","✔","","","","✔","","","✔","","✔","✔"]
[null,20,"+",20,"+",50,"+",60,null,null,150,"✔","","","✔","✔","","","✔","","","✔","✔","","","","","✔","✔","","","✔","","","✔","✔","✔","✔"]
[null,20,"+",20,"+",60,"+",60,null,null,160,"✔","","","","✔","","","✔","","","","✔",{"$f":"IF(OR($K138=\"Under lower limitation\",$K138=\"Over upper limitation\"),\"\",IF(COUNTIF($B138:$J138,X$5),\"✔\",\"\"))","v":""},"","","","","✔","","","","","","","✔","",""]
[null,20,"+",20,"+",60,"+",71,null,null,"Over upper limitation",{"$f":"IF(OR($K139=\"Under lower limitation\",$K139=\"Over upper limitation\"),\"\",IF(COUNTIF($B139:$J139,L$5),\"✔\",\"\"))","v":""},"","","","","","","","","","","","","","","","","","","","","","","","","",""]
[null,20,"+",20,"+",60,"+",80,null,null,"Over upper limitation","","","","","","","","","","","","","","","","","","","","","","","","","","",""]
[null,20,"+",20,"+",71,"+",71,null,null,{"$f":"IF(SUM(B141,D141,F141,H141,J141)<90,\"Under lower limitation\",IF(SUM(B141,D141,F141,H141,J141)>160,\"Over upper limitation\",SUM(B141,D141,F141,H141,J141)))","v":"Over upper limitation"},{"$f":"IF(OR($K141=\"Under lower limitation\",$K141=\"Over upper limitation\"),\"\",IF(COUNTIF($B141:$J141,L$5),\"✔\",\"\"))","v":""},"","","","","","","","","","","","","","","","","","","","","","","","","",""]
[null,20,"+",20,"+",71,"+",80,null,null,"Over upper limitation","","","","","","","","","","","","","","","","","","","","","","","","","","",""]
[null,20,"+",20,"+",80,"+",80,null,null,{"$f":"IF(SUM(B143,D143,F143,H143,J143)<90,\"Under lower limitation\",IF(SUM(B143,D143,F143,H143,J143)>160,\"Over upper limitation\",SUM(B143,D143,F143,H143,J143)))","v":"Over upper limitation"},"","","","","","","","","","","","","","","","","","","","","","","","","","",""]
[null,20,"+",25,"+",25,"+",25,null,null,95,"✔","✔","","","","","","✔","✔","","","✔","✔","","✔","","","","✔","","","✔","","","","",""]
[null,20,"+",25,"+",25,"+",35,null,null,105,"✔","✔","✔","","","","","✔","✔","✔","","✔","✔","✔","✔","✔","","","✔","✔","","✔","✔","","","",""]
[null,20,"+",25,"+",25,"+",50,null,null,120,"✔","✔","","✔","","","","✔","✔","","✔","✔","✔","","✔","","✔","","✔","","✔","✔","","✔","","✔","✔"]
[null,20,"+",25,"+",25,"+",60,null,null,130,"✔","✔","","","✔","","","✔","✔","","","✔","✔","","✔","","","✔","✔","","","✔","","","✔","",""]
[null,20,"+",25,"+",25,"+",71,null,null,141,"✔","✔","","","","✔","","✔","✔","","","✔","✔","","✔","","","","✔","","","✔","","","","",""]
[null,20,"+",25,"+",25,"+",80,null,null,{"$f":"IF(SUM(B149,D149,F149,H149,J149)<90,\"Under lower limitation\",IF(SUM(B149,D149,F149,H149,J149)>160,\"Over upper limitation\",SUM(B149,D149,F149,H149,J149)))","v":150},{"$f":"IF(OR($K149=\"Under lower limitation\",$K149=\"Over upper limitation\"),\"\",IF(COUNTIF($B149:$J149,L$5),\"✔\",\"\"))","v":"✔"},"✔","","","","","✔","✔","✔","","","✔","✔","","✔","","","","✔","","","✔","","","","",""]
[null,20,"+",25,"+",35,"+",35,null,null,115,"✔","✔","✔","","","","","✔","✔","✔","","✔","✔","✔","✔","✔","","","✔","✔","","✔","✔","","","",""]
[null,20,"+",25,"+",35,"+",50,null,null,130,"✔","✔","✔","✔","","","","✔","✔","✔","✔","✔","✔","✔","✔","✔","✔","","✔","✔","✔","✔","✔","✔","","✔","✔"]
[null,20,"+",25,"+",35,"+",60,null,null,140,"✔","✔","✔","","✔","","","✔","✔","✔","","✔",{"$f":"IF(OR($K152=\"Under lower limitation\",$K152=\"Over upper limitation\"),\"\",IF(COUNTIF($B152:$J152,X$5),\"✔\",\"\"))","v":"✔"},"✔","✔","✔","","✔","✔","✔","","✔","✔","","✔","",""]
[null,20,"+",25,"+",35,"+",71,null,null,151,{"$f":"IF(OR($K153=\"Under lower limitation\",$K153=\"Over upper limitation\"),\"\",IF(COUNTIF($B153:$J153,L$5),\"✔\",\"\"))","v":"✔"},"✔","✔","","","✔","","✔","✔","✔","","✔","✔","✔","✔","✔","","","✔","✔","","✔","✔","","","",""]
[null,20,"+",25,"+",35,"+",80,null,null,{"$f":"IF(SUM(B154,D154,F154,H154,J154)<90,\"Under lower limitation\",IF(SUM(B154,D154,F154,H154,J154)>160,\"Over upper limitation\",SUM(B154,D154,F154,H154,J154)))","v":160},{"$f":"IF(OR($K154=\"Under lower limitation\",$K154=\"Over upper limitation\"),\"\",IF(COUNTIF($B154:$J154,L$5),\"✔\",\"\"))","v":"✔"},"✔","✔","","","","✔","✔","✔","✔","","✔","✔","✔","✔","✔","","","✔","✔","","✔","✔","","","",""]
[null,20,"+",25,"+",50,"+",50,null,null,145,"✔","✔","","✔","","","","✔","✔","","✔","✔","✔","","✔","","✔","","✔","","✔","✔","","✔","","✔","✔"]
[null,20,"+",25,"+",50,"+",60,null,null,155,"✔","✔","","✔","✔","","","✔","✔","","✔","✔","✔","","✔","","✔","✔","✔","","✔","✔","","✔","✔","✔","✔"]
[null,20,"+",25,"+",50,"+",71,null,null,"Over upper limitation","","","","","","","","","","","","","","","","","","","","","","","","","","",""]
[null,20,"+",25,"+",50,"+",80,null,null,{"$f":"IF(SUM(B158,D158,F158,H158,J158)<90,\"Under lower limitation\",IF(SUM(B158,D158,F158,H158,J158)>160,\"Over upper limitation\",SUM(B158,D158,F158,H158,J158)))","v":"Over upper limitation"},{"$f":"IF(OR($K158=\"Under lower limitation\",$K158=\"Over upper limitation\"),\"\",IF(COUNTIF($B158:$J158,L$5),\"✔\",\"\"))","v":""},"","","","","","","","","","","","","","","","","","","","","","","","","",""]
[null,20,"+",25,"+",60,"+",60,null,null,"Over upper limitation","","","","","","","","","","","","","","","","","","","","","","","","","","",""]
[null,20,"+",25,"+",60,"+",71,null,null,"Over upper limitation","","","","","","","","","","","","","","","","","","","","","","","","","","",""]
[null,20,"+",25,"+",60,"+",80,null,null,{"$f":"IF(SUM(B161,D161,F161,H161,J161)<90,\"Under lower limitation\",IF(SUM(B161,D161,F161,H161,J161)>160,\"Over upper limitation\",SUM(B161,D161,F161,H161,J161)))","v":"Over upper limitation"},{"$f":"IF(OR($K161=\"Under lower limitation\",$K161=\"Over upper limitation\"),\"\",IF(COUNTIF($B161:$J161,L$5),\"✔\",\"\"))","v":""},"","","","","","","","","","","","","","","","","","","","","","","","","",""]
[null,20,"+",25,"+",71,"+",71,null,null,"Over upper limitation","","","","","","","","","","","","","","","","","","","","","","","","","","",""]
[null,20,"+",25,"+",71,"+",80,null,null,"Over upper limitation","","","","","","","","","","","","","","","","","","","","","","","","","","",""]
[null,20,"+",25,"+",80,"+",80,null,null,{"$f":"IF(SUM(B164,D164,F164,H164,J164)<90,\"Under lower limitation\",IF(SUM(B164,D164,F164,H164,J164)>160,\"Over upper limitation\",SUM(B164,D164,F164,H164,J164)))","v":"Over upper limitation"},"","","","","","","","","","","","","","","","","","","","","","","","","","",""]
[null,20,"+",35,"+",35,"+",35,null,null,125,"✔","","✔","","","","","✔","","✔","","✔","","✔","","✔","","","","✔","","","✔","","","",""]
[null,20,"+",35,"+",35,"+",50,null,null,140,"✔","","✔","✔","","","","✔","","✔","✔","✔","","✔","","✔","✔","","","✔","✔","","✔","✔","","✔","✔"]
[null,20,"+",35,"+",35,"+",60,null,null,150,"✔","","✔","","✔","","","✔","","✔","","✔",{"$f":"IF(OR($K167=\"Under lower limitation\",$K167=\"Over upper limitation\"),\"\",IF(COUNTIF($B167:$J167,X$5),\"✔\",\"\"))","v":""},"✔","","✔","","✔","","✔","","","✔","","✔","",""]
[null,20,"+",35,"+",35,"+",71,null,null,"Over upper limitation",{"$f":"IF(OR($K168=\"Under lower limitation\",$K168=\"Over upper limitation\"),\"\",IF(COUNTIF($B168:$J168,L$5),\"✔\",\"\"))","v":""},"","","","","","","","","","","","","","","","","","","","","","","","","",""]
[null,20,"+",35,"+",35,"+",80,null,null,{"$f":"IF(SUM(B169,D169,F169,H169,J169)<90,\"Under lower limitation\",IF(SUM(B169,D169,F169,H169,J169)>160,\"Over upper limitation\",SUM(B169,D169,F169,H169,J169)))","v":"Over upper limitation"},{"$f":"IF(OR($K169=\"Under lower limitation\",$K169=\"Over upper limitation\"),\"\",IF(COUNTIF($B169:$J169,L$5),\"✔\",\"\"))","v":""},"","","","","","","","","","","","","","","","","","","","","","","","","",""]
[null,20,"+",35,"+",50,"+",50,null,null,155,"✔","","✔","✔","","","","✔","","✔","✔","✔","","✔","","✔","✔","","","✔","✔","","✔","✔","","✔","✔"]
[null,20,"+",35,"+",50,"+",60,null,null,"Over upper limitation","","","","","","","","","","","","","","","","","","","","","","","","","","",""]
[null,20,"+",35,"+",50,"+",71,null,null,"Over upper limitation","","","","","","","","","","","","","","","","","","","","","","","","","","",""]
[null,20,"+",35,"+",50,"+",80,null,null,{"$f":"IF(SUM(B173,D173,F173,H173,J173)<90,\"Under lower limitation\",IF(SUM(B173,D173,F173,H173,J173)>160,\"Over upper limitation\",SUM(B173,D173,F173,H173,J173)))","v":"Over upper limitation"},{"$f":"IF(OR($K173=\"Under lower limitation\",$K173=\"Over upper limitation\"),\"\",IF(COUNTIF($B173:$J173,L$5),\"✔\",\"\"))","v":""},"","","","","","","","","","","","","","","","","","","","","","","","","",""]
[null,20,"+",50,"+",50,"+",50,null,null,"Over upper limitation","","","","","","","","","","","","","","","","","","","","","","","","","","",""]
[null,20,"+",50,"+",50,"+",60,null,null,"Over upper limitation","","","","","","","","","","","","","","","","","","","","","","","","","","",""]
[null,20,"+",50,"+",50,"+",71,null,null,"Over upper limitation","","","","","","","","","","","","","","","","","","","","","","","","","","",""]
[null,20,"+",50,"+",50,"+",80,null,null,{"$f":"IF(SUM(B177,D177,F177,H177,J177)<90,\"Under lower limitation\",IF(SUM(B177,D177,F177,H177,J177)>160,\"Over upper limitation\",SUM(B177,D177,F177,H177,J177)))","v":"Over upper limitation"},{"$f":"IF(OR($K177=\"Under lower limitation\",$K177=\"Over upper limitation\"),\"\",IF(COUNTIF($B177:$J177,L$5),\"✔\",\"\"))","v":""},"","","","","","","","","","","","","","","","","","","","","","","","","",""]
[null,20,"+",50,"+",60,"+",60,null,null,{"$f":"IF(SUM(B178,D178,F178,H178,J178)<90,\"Under lower limitation\",IF(SUM(B178,D178,F178,H178,J178)>160,\"Over upper limitation\",SUM(B178,D178,F178,H178,J178)))","v":"Over upper limitation"},"","","","","","","","","","","","","","","","","","","","","","","","","","",""]
[null,20,"+",50,"+",60,"+",71,null,null,"Over upper limitation","","","","","","","","","","","","","","","","","","","","","","","","","","",""]
[null,20,"+",50,"+",60,"+",80,null,null,{"$f":"IF(SUM(B180,D180,F180,H180,J180)<90,\"Under lower limitation\",IF(SUM(B180,D180,F180,H180,J180)>160,\"Over upper limitation\",SUM(B180,D180,F180,H180,J180)))","v":"Over upper limitation"},{"$f":"IF(OR($K180=\"Under lower limitation\",$K180=\"Over upper limitation\"),\"\",IF(COUNTIF($B180:$J180,L$5),\"✔\",\"\"))","v":""},"","","","","","","","","","","","","","","","","","","","","","","","","",""]
[null,20,"+",50,"+",71,"+",71,null,null,"Over upper limitation","","","","","","","","","","","","",{"$f":"IF(OR($K181=\"Under lower limitation\",$K181=\"Over upper limitation\"),\"\",IF(COUNTIF($B181:$J181,X$5),\"✔\",\"\"))","v":""},"","","","","","","","","","","","","",""]
[null,20,"+",50,"+",71,"+",80,null,null,{"$f":"IF(SUM(B182,D182,F182,H182,J182)<90,\"Under lower limitation\",IF(SUM(B182,D182,F182,H182,J182)>160,\"Over upper limitation\",SUM(B182,D182,F182,H182,J182)))","v":"Over upper limitation"},{"$f":"IF(OR($K182=\"Under lower limitation\",$K182=\"Over upper limitation\"),\"\",IF(COUNTIF($B182:$J182,L$5),\"✔\",\"\"))","v":""},"","","","","","","","","","","","","","","","","","","","","","","","","",""]
[null,20,"+",50,"+",80,"+",80,null,null,{"$f":"IF(SUM(B183,D183,F183,H183,J183)<90,\"Under lower limitation\",IF(SUM(B183,D183,F183,H183,J183)>160,\"Over upper limitation\",SUM(B183,D183,F183,H183,J183)))","v":"Over upper limitation"},"","","","","","","","","","","","","","","","","","","","","","","","","","",""]
[null,20,"+",60,"+",60,"+",60,null,null,"Over upper limitation",{"$f":"IF(OR($K184=\"Under lower limitation\",$K184=\"Over upper limitation\"),\"\",IF(COUNTIF($B184:$J184,L$5),\"✔\",\"\"))","v":""},"","","","","","","","","","","","","","","","","","","","","","","","","",""]
[null,20,"+",60,"+",60,"+",71,null,null,"Over upper limitation","","","","","","","","","","","","","","","","","","","","","","","","","","",""]
[null,20,"+",60,"+",60,"+",80,null,null,{"$f":"IF(SUM(B186,D186,F186,H186,J186)<90,\"Under lower limitation\",IF(SUM(B186,D186,F186,H186,J186)>160,\"Over upper limitation\",SUM(B186,D186,F186,H186,J186)))","v":"Over upper limitation"},{"$f":"IF(OR($K186=\"Under lower limitation\",$K186=\"Over upper limitation\"),\"\",IF(COUNTIF($B186:$J186,L$5),\"✔\",\"\"))","v":""},"","","","","","","","","","","","","","","","","","","","","","","","","",""]
[null,20,"+",60,"+",71,"+",71,null,null,"Over upper limitation","","","","","","","","","","","","","","","","","","","","","","","","","","",""]
[null,20,"+",60,"+",71,"+",80,null,null,{"$f":"IF(SUM(B188,D188,F188,H188,J188)<90,\"Under lower limitation\",IF(SUM(B188,D188,F188,H188,J188)>160,\"Over upper limitation\",SUM(B188,D188,F188,H188,J188)))","v":"Over upper limitation"},{"$f":"IF(OR($K188=\"Under lower limitation\",$K188=\"Over upper limitation\"),\"\",IF(COUNTIF($B188:$J188,L$5),\"✔\",\"\"))","v":""},"","","","","","","","","","","","","","","","","","","","","","","","","",""]
[null,20,"+",71,"+",80,"+",80,null,null,"Over upper limitation","","","","","","","","","","","","","","","","","","","","","","","","","","",""]
[null,20,"+",80,"+",80,"+",80,null,null,"Over upper limitation","","","","","","","","","","","","","","","","","","","","","","","","","","",""]
[null,25,"+",25,"+",25,"+",25,null,null,100,"","✔","","","","","","","✔","","","","✔","","✔","","","","✔","","","✔","","","","",""]
[null,25,"+",25,"+",25,"+",35,null,null,110,"","✔","✔","","","","","","✔","✔","","","✔","✔","✔","✔","","","✔","✔","","✔","✔","","","",""]
[null,25,"+",25,"+",25,"+",50,null,null,125,"","✔","","✔","","","","","✔","","✔","","✔","","✔","","✔","","✔","","✔","✔","","✔","","✔","✔"]
[null,25,"+",25,"+",25,"+",60,null,null,135,"","✔","","","✔","","","","✔","","","","✔","","✔","","","✔","✔","","","✔","","","✔","",""]
[null,25,"+",25,"+",25,"+",71,null,null,146,"","✔","","","","✔","","","✔","","","","✔","","✔","","","","✔","","","✔","","","","",""]
[null,25,"+",25,"+",25,"+",80,null,null,{"$f":"IF(SUM(B196,D196,F196,H196,J196)<90,\"Under lower limitation\",IF(SUM(B196,D196,F196,H196,J196)>160,\"Over upper limitation\",SUM(B196,D196,F196,H196,J196)))","v":155},{"$f":"IF(OR($K196=\"Under lower limitation\",$K196=\"Over upper limitation\"),\"\",IF(COUNTIF($B196:$J196,L$5),\"✔\",\"\"))","v":""},"✔","","","","","✔","","✔","","","","✔","","✔","","","","✔","","","✔","","","","",""]
[null,25,"+",25,"+",35,"+",35,null,null,120,"","✔","✔","","","","","","✔","✔","","",{"$f":"IF(OR($K197=\"Under lower limitation\",$K197=\"Over upper limitation\"),\"\",IF(COUNTIF($B197:$J197,X$5),\"✔\",\"\"))","v":"✔"},"✔","✔","✔","","","✔","✔","","✔","✔","","","",""]
[null,25,"+",25,"+",35,"+",50,null,null,135,{"$f":"IF(OR($K198=\"Under lower limitation\",$K198=\"Over upper limitation\"),\"\",IF(COUNTIF($B198:$J198,L$5),\"✔\",\"\"))","v":""},"✔","✔","✔","","","","","✔","✔","✔","","✔","✔","✔","✔","✔","","✔","✔","✔","✔","✔","✔","","✔","✔"]
[null,25,"+",25,"+",35,"+",60,null,null,145,"","✔","✔","","✔","","","","✔","✔","","","✔","✔","✔","✔","","✔","✔","✔","","✔","✔","","✔","",""]
[null,25,"+",25,"+",35,"+",71,null,null,156,"","✔","✔","","","✔","","","✔","✔","","","✔","✔","✔","✔","","","✔","✔","","✔","✔","","","",""]
[null,25,"+",25,"+",35,"+",80,null,null,{"$f":"IF(SUM(B201,D201,F201,H201,J201)<90,\"Under lower limitation\",IF(SUM(B201,D201,F201,H201,J201)>160,\"Over upper limitation\",SUM(B201,D201,F201,H201,J201)))","v":"Over upper limitation"},{"$f":"IF(OR($K201=\"Under lower limitation\",$K201=\"Over upper limitation\"),\"\",IF(COUNTIF($B201:$J201,L$5),\"✔\",\"\"))","v":""},"","","","","","","","","","","","","","","","","","","","","","","","","",""]
[null,25,"+",25,"+",50,"+",50,null,null,150,"","✔","","✔","","","","","✔","","✔","","✔","","✔","","✔","","✔","","✔","✔","","✔","","✔","✔"]
[null,25,"+",25,"+",50,"+",60,null,null,160,"","✔","","✔","✔","","","","✔","","✔","","✔","","✔","","✔","✔","✔","","✔","✔","","✔","✔","✔","✔"]
[null,25,"+",25,"+",50,"+",71,null,null,"Over upper limitation","","","","","","","","","","","","","","","","","","","","","","","","","","",""]
[null,25,"+",25,"+",50,"+",80,null,null,{"$f":"IF(SUM(B205,D205,F205,H205,J205)<90,\"Under lower limitation\",IF(SUM(B205,D205,F205,H205,J205)>160,\"Over upper limitation\",SUM(B205,D205,F205,H205,J205)))","v":"Over upper limitation"},{"$f":"IF(OR($K205=\"Under lower limitation\",$K205=\"Over upper limitation\"),\"\",IF(COUNTIF($B205:$J205,L$5),\"✔\",\"\"))","v":""},"","","","","","","","","","","","","","","","","","","","","","","","","",""]
[null,25,"+",25,"+",60,"+",60,null,null,"Over upper limitation","","","","","","","","","","","","","","","","","","","","","","","","","","",""]
[null,25,"+",25,"+",60,"+",71,null,null,"Over upper limitation","","","","","","","","","","","","","","","","","","","","","","","","","","",""]
[null,25,"+",25,"+",60,"+",80,null,null,"Over upper limitation","","","","","","","","","","","","","","","","","","","","","","","","","","",""]
[null,25,"+",25,"+",71,"+",71,null,null,{"$f":"IF(SUM(B209,D209,F209,H209,J209)<90,\"Under lower limitation\",IF(SUM(B209,D209,F209,H209,J209)>160,\"Over upper limitation\",SUM(B209,D209,F209,H209,J209)))","v":"Over upper limitation"},{"$f":"IF(OR($K209=\"Under lower limitation\",$K209=\"Over upper limitation\"),\"\",IF(COUNTIF($B209:$J209,L$5),\"✔\",\"\"))","v":""},"","","","","","","","","","","","","","","","","","","","","","","","","",""]
[null,25,"+",25,"+",71,"+",80,null,null,"Over upper limitation","","","","","","","","","","","","","","","","","","","","","","","","","","",""]
[null,25,"+",25,"+",80,"+",80,null,null,{"$f":"IF(SUM(B211,D211,F211,H211,J211)<90,\"Under lower limitation\",IF(SUM(B211,D211,F211,H211,J211)>160,\"Over upper limitation\",SUM(B211,D211,F211,H211,J211)))","v":"Over upper limitation"},"","","","","","","","","","","","","","","","","","","","","","","","","","",""]
[null,25,"+",35,"+",35,"+",35,null,null,130,"","✔","✔","","","","","","✔","✔","","",{"$f":"IF(OR($K212=\"Under lower limitation\",$K212=\"Over upper limitation\"),\"\",IF(COUNTIF($B212:$J212,X$5),\"✔\",\"\"))","v":"✔"},"✔","✔","✔","","","✔","✔","","✔","✔","","","",""]
[null,25,"+",35,"+",35,"+",50,null,null,145,{"$f":"IF(OR($K213=\"Under lower limitation\",$K213=\"Over upper limitation\"),\"\",IF(COUNTIF($B213:$J213,L$5),\"✔\",\"\"))","v":""},"✔","✔","✔","","","","","✔","✔","✔","","✔","✔","✔","✔","✔","","✔","✔","✔","✔","✔","✔","","✔","✔"]
[null,25,"+",35,"+",35,"+",60,null,null,155,"","✔","✔","","✔","","","","✔","✔","","","✔","✔","✔","✔","","✔","✔","✔","","✔","✔","","✔","",""]
[null,25,"+",35,"+",35,"+",71,null,null,"Over upper limitation","","","","","","","","","","","","","","","","","","","","","","","","","","",""]
[null,25,"+",35,"+",35,"+",80,null,null,{"$f":"IF(SUM(B216,D216,F216,H216,J216)<90,\"Under lower limitation\",IF(SUM(B216,D216,F216,H216,J216)>160,\"Over upper limitation\",SUM(B216,D216,F216,H216,J216)))","v":"Over upper limitation"},{"$f":"IF(OR($K216=\"Under lower limitation\",$K216=\"Over upper limitation\"),\"\",IF(COUNTIF($B216:$J216,L$5),\"✔\",\"\"))","v":""},"","","","","","","","","","","","","","","","","","","","","","","","","",""]
[null,25,"+",35,"+",50,"+",50,null,null,160,"","✔","✔","✔","","","","","✔","✔","✔","","✔","✔","✔","✔","✔","","✔","✔","✔","✔","✔","✔","","✔","✔"]
[null,25,"+",35,"+",50,"+",60,null,null,"Over upper limitation","","","","","","","","","","","","","","","","","","","","","","","","","","",""]
[null,25,"+",35,"+",50,"+",71,null,null,"Over upper limitation","","","","","","","","","","","","","","","","","","","","","","","","","","",""]
[null,25,"+",35,"+",50,"+",80,null,null,{"$f":"IF(SUM(B220,D220,F220,H220,J220)<90,\"Under lower limitation\",IF(SUM(B220,D220,F220,H220,J220)>160,\"Over upper limitation\",SUM(B220,D220,F220,H220,J220)))","v":"Over upper limitation"},{"$f":"IF(OR($K220=\"Under lower limitation\",$K220=\"Over upper limitation\"),\"\",IF(COUNTIF($B220:$J220,L$5),\"✔\",\"\"))","v":""},"","","","","","","","","","","","","","","","","","","","","","","","","",""]
[null,25,"+",35,"+",60,"+",60,null,null,"Over upper limitation","","","","","","","","","","","","","","","","","","","","","","","","","","",""]
[null,25,"+",35,"+",60,"+",71,null,null,"Over upper limitation","","","","","","","","","","","","","","","","","","","","","","","","","","",""]
[null,25,"+",35,"+",60,"+",80,null,null,{"$f":"IF(SUM(B223,D223,F223,H223,J223)<90,\"Under lower limitation\",IF(SUM(B223,D223,F223,H223,J223)>160,\"Over upper limitation\",SUM(B223,D223,F223,H223,J223)))","v":"Over upper limitation"},{"$f":"IF(OR($K223=\"Under lower limitation\",$K223=\"Over upper limitation\"),\"\",IF(COUNTIF($B223:$J223,L$5),\"✔\",\"\"))","v":""},"","","","","","","","","","","","","","","","","","","","","","","","","",""]
[null,25,"+",35,"+",71,"+",71,null,null,"Over upper limitation","","","","","","","","","","","","","","","","","","","","","","","","","","",""]
[null,25,"+",35,"+",71,"+",80,null,null,"Over upper limitation","","","","","","","","","","","","","","","","","","","","","","","","","","",""]
[null,25,"+",35,"+",80,"+",80,null,null,{"$f":"IF(SUM(B226,D226,F226,H226,J226)<90,\"Under lower limitation\",IF(SUM(B226,D226,F226,H226,J226)>160,\"Over upper limitation\",SUM(B226,D226,F226,H226,J226)))","v":"Over upper limitation"},"","","","","","","","","","","","","","","","","","","","","","","","","","",""]
[null,25,"+",50,"+",50,"+",50,null,null,"Over upper limitation","","","","","","","","","","","","",{"$f":"IF(OR($K227=\"Under lower limitation\",$K227=\"Over upper limitation\"),\"\",IF(COUNTIF($B227:$J227,X$5),\"✔\",\"\"))","v":""},"","","","","","","","","","","","","",""]
[null,25,"+",50,"+",50,"+",60,null,null,"Over upper limitation","","","","","","","","","","","","","","","","","","","","","","","","","","",""]
[null,25,"+",50,"+",50,"+",71,null,null,"Over upper limitation","","","","","","","","","","","","","","","","","","","","","","","","","","",""]
[null,25,"+",50,"+",50,"+",80,null,null,{"$f":"IF(SUM(B230,D230,F230,H230,J230)<90,\"Under lower limitation\",IF(SUM(B230,D230,F230,H230,J230)>160,\"Over upper limitation\",SUM(B230,D230,F230,H230,J230)))","v":"Over upper limitation"},"","","","","","","","","","","","","","","","","","","","","","","","","","",""]
[null,25,"+",50,"+",60,"+",60,null,null,"Over upper limitation",{"$f":"IF(OR($K231=\"Under lower limitation\",$K231=\"Over upper limitation\"),\"\",IF(COUNTIF($B231:$J231,L$5),\"✔\",\"\"))","v":""},"","","","","","","","","","","","","","","","","","","","","","","","","",""]
[null,25,"+",50,"+",60,"+",71,null,null,"Over upper limitation","","","","","","","","","","","","","","","","","","","","","","","","","","",""]
[null,25,"+",50,"+",60,"+",80,null,null,{"$f":"IF(SUM(B233,D233,F233,H233,J233)<90,\"Under lower limitation\",IF(SUM(B233,D233,F233,H233,J233)>160,\"Over upper limitation\",SUM(B233,D233,F233,H233,J233)))","v":"Over upper limitation"},{"$f":"IF(OR($K233=\"Under lower limitation\",$K233=\"Over upper limitation\"),\"\",IF(COUNTIF($B233:$J233,L$5),\"✔\",\"\"))","v":""},"","","","","","","","","","","","","","","","","","","","","","","","","",""]
[null,25,"+",50,"+",71,"+",71,null,null,"Over upper limitation","","","","","","","","","","","","","","","","","","","","","","","","","","",""]
[null,25,"+",60,"+",71,"+",80,null,null,"Over upper limitation","","","","","","","","","","","","","","","","","","","","","","","","","","",""]
[null,25,"+",50,"+",80,"+",80,null,null,"Over upper limitation","","","","","","","","","","","","","","","","","","","","","","","","","","",""]
[null,25,"+",60,"+",60,"+",60,null,null,"Over upper limitation","","","","","","","","","","","","","","","","","","","","","","","","","","",""]
[null,25,"+",60,"+",60,"+",71,null,null,"Over upper limitation","","","","","","","","","","","","","","","","","","","","","","","","","","",""]
[null,25,"+",60,"+",60,"+",80,null,null,{"$f":"IF(SUM(B239,D239,F239,H239,J239)<90,\"Under lower limitation\",IF(SUM(B239,D239,F239,H239,J239)>160,\"Over upper limitation\",SUM(B239,D239,F239,H239,J239)))","v":"Over upper limitation"},{"$f":"IF(OR($K239=\"Under lower limitation\",$K239=\"Over upper limitation\"),\"\",IF(COUNTIF($B239:$J239,L$5),\"✔\",\"\"))","v":""},"","","","","","","","","","","","","","","","","","","","","","","","","",""]
[null,25,"+",60,"+",71,"+",71,null,null,"Over upper limitation","","","","","","","","","","","","","","","","","","","","","","","","","","",""]
[null,25,"+",60,"+",71,"+",80,null,null,{"$f":"IF(SUM(B241,D241,F241,H241,J241)<90,\"Under lower limitation\",IF(SUM(B241,D241,F241,H241,J241)>160,\"Over upper limitation\",SUM(B241,D241,F241,H241,J241)))","v":"Over upper limitation"},{"$f":"IF(OR($K241=\"Under lower limitation\",$K241=\"Over upper limitation\"),\"\",IF(COUNTIF($B241:$J241,L$5),\"✔\",\"\"))","v":""},"","","","","","","","","","","","","","","","","","","","","","","","","",""]
[null,25,"+",60,"+",80,"+",80,null,null,{"$f":"IF(SUM(B242,D242,F242,H242,J242)<90,\"Under lower limitation\",IF(SUM(B242,D242,F242,H242,J242)>160,\"Over upper limitation\",SUM(B242,D242,F242,H242,J242)))","v":"Over upper limitation"},"","","","","","","","","","","","","","","","","","","","","","","","","","",""]
[null,25,"+",71,"+",71,"+",71,null,null,"Over upper limitation","","","","","","","","","","","","","","","","","","","","","","","","","","",""]
[null,25,"+",71,"+",71,"+",80,null,null,{"$f":"IF(SUM(B244,D244,F244,H244,J244)<90,\"Under lower limitation\",IF(SUM(B244,D244,F244,H244,J244)>160,\"Over upper limitation\",SUM(B244,D244,F244,H244,J244)))","v":"Over upper limitation"},{"$f":"IF(OR($K244=\"Under lower limitation\",$K244=\"Over upper limitation\"),\"\",IF(COUNTIF($B244:$J244,L$5),\"✔\",\"\"))","v":""},"","","","","","","","","","","","","","","","","","","","","","","","","",""]
[null,25,"+",71,"+",80,"+",80,null,null,{"$f":"IF(SUM(B245,D245,F245,H245,J245)<90,\"Under lower limitation\",IF(SUM(B245,D245,F245,H245,J245)>160,\"Over upper limitation\",SUM(B245,D245,F245,H245,J245)))","v":"Over upper limitation"},"","","","","","","","","","","","","","","","","","","","","","","","","","",""]
[null,25,"+",80,"+",80,"+",80,null,null,{"$f":"IF(SUM(B246,D246,F246,H246,J246)<90,\"Under lower limitation\",IF(SUM(B246,D246,F246,H246,J246)>160,\"Over upper limitation\",SUM(B246,D246,F246,H246,J246)))","v":"Over upper limitation"},"","","","","","","","","","","","","","","","","","","","","","","","","","",""]
[null,35,"+",35,"+",35,"+",35,null,null,140,"","","✔","","","","","","","✔","","","","✔","","✔","","","","✔","","","✔","","","",""]
[null,35,"+",35,"+",35,"+",50,null,null,155,"","","✔","✔","","","","","","✔","✔","","","✔","","✔","✔","","","✔","✔","","✔","✔","","✔","✔"]
[null,35,"+",35,"+",35,"+",60,null,null,"Over upper limitation","","","","","","","","","","","","",{"$f":"IF(OR($K249=\"Under lower limitation\",$K249=\"Over upper limitation\"),\"\",IF(COUNTIF($B249:$J249,X$5),\"✔\",\"\"))","v":""},"","","","","","","","","","","","","",""]
[null,35,"+",35,"+",35,"+",71,null,null,"Over upper limitation",{"$f":"IF(OR($K250=\"Under lower limitation\",$K250=\"Over upper limitation\"),\"\",IF(COUNTIF($B250:$J250,L$5),\"✔\",\"\"))","v":""},"","","","","","","","","","","","","","","","","","","","","","","","","",""]
[null,35,"+",35,"+",35,"+",80,null,null,"Over upper limitation","","","","","","","","","","","","","","","","","","","","","","","","","","",""]
[null,35,"+",35,"+",50,"+",50,null,null,"Over upper limitation","","","","","","","","","","","","","","","","","","","","","","","","","","",""]
[null,35,"+",35,"+",50,"+",60,null,null,"Over upper limitation","","","","","","","","","","","","","","","","","","","","","","","","","","",""]
[null,35,"+",35,"+",50,"+",71,null,null,"Over upper limitation","","","","","","","","","","","","","","","","","","","","","","","","","","",""]
[null,35,"+",35,"+",50,"+",80,null,null,{"$f":"IF(SUM(B255,D255,F255,H255,J255)<90,\"Under lower limitation\",IF(SUM(B255,D255,F255,H255,J255)>160,\"Over upper limitation\",SUM(B255,D255,F255,H255,J255)))","v":"Over upper limitation"},{"$f":"IF(OR($K255=\"Under lower limitation\",$K255=\"Over upper limitation\"),\"\",IF(COUNTIF($B255:$J255,L$5),\"✔\",\"\"))","v":""},"","","","","","","","","","","","","","","","","","","","","","","","","",""]
[null,35,"+",35,"+",60,"+",60,null,null,"Over upper limitation","","","","","","","","","","","","","","","","","","","","","","","","","","",""]
[null,35,"+",35,"+",60,"+",71,null,null,"Over upper limitation","","","","","","","","","","","","","","","","","","","","","","","","","","",""]
[null,35,"+",35,"+",60,"+",80,null,null,{"$f":"IF(SUM(B258,D258,F258,H258,J258)<90,\"Under lower limitation\",IF(SUM(B258,D258,F258,H258,J258)>160,\"Over upper limitation\",SUM(B258,D258,F258,H258,J258)))","v":"Over upper limitation"},{"$f":"IF(OR($K258=\"Under lower limitation\",$K258=\"Over upper limitation\"),\"\",IF(COUNTIF($B258:$J258,L$5),\"✔\",\"\"))","v":""},"","","","","","","","","","","","","","","","","","","","","","","","","",""]
[null,35,"+",35,"+",71,"+",71,null,null,"Over upper limitation","","","","","","","","","","","","","","","","","","","","","","","","","","",""]
[null,35,"+",35,"+",71,"+",80,null,null,"Over upper limitation","","","","","","","","","","","","","","","","","","","","","","","","","","",""]
[null,35,"+",35,"+",80,"+",80,null,null,{"$f":"IF(SUM(B261,D261,F261,H261,J261)<90,\"Under lower limitation\",IF(SUM(B261,D261,F261,H261,J261)>160,\"Over upper limitation\",SUM(B261,D261,F261,H261,J261)))","v":"Over upper limitation"},"","","","","","","","","","","","","","","","","","","","","","","","","","",""]
[null,35,"+",50,"+",50,"+",50,null,null,"Over upper limitation","","","","","","","","","","","","","","","","","","","","","","","","","","",""]
[null,35,"+",50,"+",50,"+",60,null,null,"Over upper limitation","","","","","","","","","","","","",{"$f":"IF(OR($K263=\"Under lower limitation\",$K263=\"Over upper limitation\"),\"\",IF(COUNTIF($B263:$J263,X$5),\"✔\",\"\"))","v":""},"","","","","","","","","","","","","",""]
[null,35,"+",50,"+",50,"+",71,null,null,"Over upper limitation",{"$f":"IF(OR($K264=\"Under lower limitation\",$K264=\"Over upper limitation\"),\"\",IF(COUNTIF($B264:$J264,L$5),\"✔\",\"\"))","v":""},"","","","","","","","","","","","","","","","","","","","","","","","","",""]
[null,35,"+",50,"+",50,"+",80,null,null,{"$f":"IF(SUM(B265,D265,F265,H265,J265)<90,\"Under lower limitation\",IF(SUM(B265,D265,F265,H265,J265)>160,\"Over upper limitation\",SUM(B265,D265,F265,H265,J265)))","v":"Over upper limitation"},{"$f":"IF(OR($K265=\"Under lower limitation\",$K265=\"Over upper limitation\"),\"\",IF(COUNTIF($B265:$J265,L$5),\"✔\",\"\"))","v":""},"","","","","","","","","","","","","","","","","","","","","","","","","",""]
[null,35,"+",50,"+",60,"+",60,null,null,"Over upper limitation","","","","","","","","","","","","","","","","","","","","","","","","","","",""]
[null,35,"+",50,"+",60,"+",71,null,null,"Over upper limitation","","","","","","","","","","","","","","","","","","","","","","","","","","",""]
[null,35,"+",50,"+",60,"+",80,null,null,{"$f":"IF(SUM(B268,D268,F268,H268,J268)<90,\"Under lower limitation\",IF(SUM(B268,D268,F268,H268,J268)>160,\"Over upper limitation\",SUM(B268,D268,F268,H268,J268)))","v":"Over upper limitation"},{"$f":"IF(OR($K268=\"Under lower limitation\",$K268=\"Over upper limitation\"),\"\",IF(COUNTIF($B268:$J268,L$5),\"✔\",\"\"))","v":""},"","","","","","","","","","","","","","","","","","","","","","","","","",""]
[null,35,"+",50,"+",71,"+",71,null,null,"Over upper limitation","","","","","","","","","","","","","","","","","","","","","","","","","","",""]
[null,35,"+",50,"+",71,"+",80,null,null,"Over upper limitation","","","","","","","","","","","","","","","","","","","","","","","","","","",""]
[null,35,"+",50,"+",80,"+",80,null,null,{"$f":"IF(SUM(B271,D271,F271,H271,J271)<90,\"Under lower limitation\",IF(SUM(B271,D271,F271,H271,J271)>160,\"Over upper limitation\",SUM(B271,D271,F271,H271,J271)))","v":"Over upper limitation"},"","","","","","","","","","","","","","","","","","","","","","","","","","",""]
[null,35,"+",60,"+",60,"+",60,null,null,"Over upper limitation","","","","","","","","","","","","","","","","","","","","","","","","","","",""]
[null,35,"+",60,"+",60,"+",71,null,null,"Over upper limitation","","","","","","","","","","","","","","","","","","","","","","","","","","",""]
[null,35,"+",60,"+",60,"+",80,null,null,{"$f":"IF(SUM(B274,D274,F274,H274,J274)<90,\"Under lower limitation\",IF(SUM(B274,D274,F274,H274,J274)>160,\"Over upper limitation\",SUM(B274,D274,F274,H274,J274)))","v":"Over upper limitation"},{"$f":"IF(OR($K274=\"Under lower limitation\",$K274=\"Over upper limitation\"),\"\",IF(COUNTIF($B274:$J274,L$5),\"✔\",\"\"))","v":""},"","","","","","","","","","","","","","","","","","","","","","","","","",""]
[null,35,"+",60,"+",71,"+",71,null,null,"Over upper limitation","","","","","","","","","","","","","","","","","","","","","","","","","","",""]
[null,35,"+",60,"+",71,"+",80,null,null,{"$f":"IF(SUM(B276,D276,F276,H276,J276)<90,\"Under lower limitation\",IF(SUM(B276,D276,F276,H276,J276)>160,\"Over upper limitation\",SUM(B276,D276,F276,H276,J276)))","v":"Over upper limitation"},{"$f":"IF(OR($K276=\"Under lower limitation\",$K276=\"Over upper limitation\"),\"\",IF(COUNTIF($B276:$J276,L$5),\"✔\",\"\"))","v":""},"","","","","","","","","","","","","","","","","","","","","","","","","",""]
[null,35,"+",60,"+",80,"+",80,null,null,"Over upper limitation","","","","","","","","","","","","","","","","","","","","","","","","","","",""]
[null,35,"+",71,"+",71,"+",71,null,null,{"$f":"IF(SUM(B278,D278,F278,H278,J278)<90,\"Under lower limitation\",IF(SUM(B278,D278,F278,H278,J278)>160,\"Over upper limitation\",SUM(B278,D278,F278,H278,J278)))","v":"Over upper limitation"},"","","","","","","","","","","","","","","","","","","","","","","","","","",""]
[null,35,"+",71,"+",71,"+",80,null,null,{"$f":"IF(SUM(B279,D279,F279,H279,J279)<90,\"Under lower limitation\",IF(SUM(B279,D279,F279,H279,J279)>160,\"Over upper limitation\",SUM(B279,D279,F279,H279,J279)))","v":"Over upper limitation"},"","","","","","","","","","","","","","","","","","","","","","","","","","",""]
[null,35,"+",71,"+",80,"+",80,null,null,{"$f":"IF(SUM(B280,D280,F280,H280,J280)<90,\"Under lower limitation\",IF(SUM(B280,D280,F280,H280,J280)>160,\"Over upper limitation\",SUM(B280,D280,F280,H280,J280)))","v":"Over upper limitation"},"","","","","","","","","","","","","","","","","","","","","","","","","","",""]
[null,35,"+",80,"+",80,"+",80,null,null,"Over upper limitation","","","","","","","","","","","","","","","","","","","","","","","","","","",""]
[5,20,"+",20,"+",20,"+",20,"+",20,100,"✔","","","","","","","✔","","","","✔","","","","","","","","","","","","","","",""]
[null,20,"+",20,"+",20,"+",20,"+",25,105,"✔","✔","","","","","","✔","✔","","","✔",{"$f":"IF(OR($K283=\"Under lower limitation\",$K283=\"Over upper limitation\"),\"\",IF(COUNTIF($B283:$J283,X$5),\"✔\",\"\"))","v":"✔"},"","✔","","","","✔","","","✔","","","","",""]
[null,20,"+",20,"+",20,"+",20,"+",35,115,{"$f":"IF(OR($K284=\"Under lower limitation\",$K284=\"Over upper limitation\"),\"\",IF(COUNTIF($B284:$J284,L$5),\"✔\",\"\"))","v":"✔"},"","✔","","","","","✔","","✔","","✔","","✔","","✔","","","","✔","","","✔","","","",""]
[null,20,"+",20,"+",20,"+",20,"+",50,{"$f":"IF(SUM(B285,D285,F285,H285,J285)<90,\"Under lower limitation\",IF(SUM(B285,D285,F285,H285,J285)>160,\"Over upper limitation\",SUM(B285,D285,F285,H285,J285)))","v":130},"✔","","","✔","","","","✔","","","✔","✔","","","","","✔","","","","✔","","","✔","","✔","✔"]
[null,20,"+",20,"+",20,"+",20,"+",60,140,"✔","","","","✔","","","✔","","","","✔","","","","","","✔","","","","","","","✔","",""]
[null,20,"+",20,"+",20,"+",20,"+",71,151,"✔","","","","","✔","","✔","","","","✔","","","","","","","","","","","","","","",""]
[null,20,"+",20,"+",20,"+",20,"+",80,{"$f":"IF(SUM(B288,D288,F288,H288,J288)<90,\"Under lower limitation\",IF(SUM(B288,D288,F288,H288,J288)>160,\"Over upper limitation\",SUM(B288,D288,F288,H288,J288)))","v":160},{"$f":"IF(OR($K288=\"Under lower limitation\",$K288=\"Over upper limitation\"),\"\",IF(COUNTIF($B288:$J288,L$5),\"✔\",\"\"))","v":"✔"},"","","","","","✔","✔","","","","✔","","","","","","","","","","","","","","",""]
[null,20,"+",20,"+",20,"+",25,"+",25,110,"✔","✔","","","","","","✔","✔","","","✔","✔","","✔","","","","✔","","","✔","","","","",""]
[null,20,"+",20,"+",20,"+",25,"+",35,120,"✔","✔","✔","","","","","✔","✔","✔","","✔","✔","✔","✔","✔","","","✔","✔","","✔","✔","","","",""]
[null,20,"+",20,"+",20,"+",25,"+",50,135,"✔","✔","","✔","","","","✔","✔","","✔","✔","✔","","✔","","✔","","✔","","✔","✔","","✔","","✔","✔"]
[null,20,"+",20,"+",20,"+",25,"+",60,145,"✔","✔","","","✔","","","✔","✔","","","✔","✔","","✔","","","✔","✔","","","✔","","","✔","",""]
[null,20,"+",20,"+",20,"+",25,"+",71,156,"✔","✔","","","","✔","","✔","✔","","","✔","✔","","✔","","","","✔","","","✔","","","","",""]
[null,20,"+",20,"+",20,"+",25,"+",80,{"$f":"IF(SUM(B294,D294,F294,H294,J294)<90,\"Under lower limitation\",IF(SUM(B294,D294,F294,H294,J294)>160,\"Over upper limitation\",SUM(B294,D294,F294,H294,J294)))","v":"Over upper limitation"},{"$f":"IF(OR($K294=\"Under lower limitation\",$K294=\"Over upper limitation\"),\"\",IF(COUNTIF($B294:$J294,L$5),\"✔\",\"\"))","v":""},"","","","","","","","","","","","","","","","","","","","","","","","","",""]
[null,20,"+",20,"+",20,"+",35,"+",35,130,"✔","","✔","","","","","✔","","✔","","✔",{"$f":"IF(OR($K295=\"Under lower limitation\",$K295=\"Over upper limitation\"),\"\",IF(COUNTIF($B295:$J295,X$5),\"✔\",\"\"))","v":""},"✔","","✔","","","","✔","","","✔","","","",""]
[null,20,"+",20,"+",20,"+",35,"+",50,145,{"$f":"IF(OR($K296=\"Under lower limitation\",$K296=\"Over upper limitation\"),\"\",IF(COUNTIF($B296:$J296,L$5),\"✔\",\"\"))","v":"✔"},"","✔","✔","","","","✔","","✔","✔","✔","","✔","","✔","✔","","","✔","✔","","✔","✔","","✔","✔"]
[null,20,"+",20,"+",20,"+",35,"+",60,155,"✔","","✔","","✔","","","✔","","✔","","✔","","✔","","✔","","✔","","✔","","","✔","","✔","",""]
[null,20,"+",20,"+",20,"+",35,"+",71,"Over upper limitation","","","","","","","","","","","","","","","","","","","","","","","","","","",""]
[null,20,"+",20,"+",20,"+",35,"+",80,{"$f":"IF(SUM(B299,D299,F299,H299,J299)<90,\"Under lower limitation\",IF(SUM(B299,D299,F299,H299,J299)>160,\"Over upper limitation\",SUM(B299,D299,F299,H299,J299)))","v":"Over upper limitation"},{"$f":"IF(OR($K299=\"Under lower limitation\",$K299=\"Over upper limitation\"),\"\",IF(COUNTIF($B299:$J299,L$5),\"✔\",\"\"))","v":""},"","","","","","","","","","","","","","","","","","","","","","","","","",""]
[null,20,"+",20,"+",20,"+",50,"+",50,160,"✔","","","✔","","","","✔","","","✔","✔","","","","","✔","","","","✔","","","✔","","✔","✔"]
[null,20,"+",20,"+",20,"+",50,"+",60,"Over upper limitation","","","","","","","","","","","","","","","","","","","","","","","","","","",""]
[null,20,"+",20,"+",20,"+",50,"+",71,"Over upper limitation","","","","","","","","","","","","","","","","","","","","","","","","","","",""]
[null,20,"+",20,"+",20,"+",50,"+",80,{"$f":"IF(SUM(B303,D303,F303,H303,J303)<90,\"Under lower limitation\",IF(SUM(B303,D303,F303,H303,J303)>160,\"Over upper limitation\",SUM(B303,D303,F303,H303,J303)))","v":"Over upper limitation"},{"$f":"IF(OR($K303=\"Under lower limitation\",$K303=\"Over upper limitation\"),\"\",IF(COUNTIF($B303:$J303,L$5),\"✔\",\"\"))","v":""},"","","","","","","","","","","","","","","","","","","","","","","","","",""]
[null,20,"+",20,"+",20,"+",60,"+",60,"Over upper limitation","","","","","","","","","","","","","","","","","","","","","","","","","","",""]
[null,20,"+",20,"+",20,"+",60,"+",71,"Over upper limitation","","","","","","","","","","","","","","","","","","","","","","","","","","",""]
[null,20,"+",20,"+",20,"+",60,"+",80,{"$f":"IF(SUM(B306,D306,F306,H306,J306)<90,\"Under lower limitation\",IF(SUM(B306,D306,F306,H306,J306)>160,\"Over upper limitation\",SUM(B306,D306,F306,H306,J306)))","v":"Over upper limitation"},{"$f":"IF(OR($K306=\"Under lower limitation\",$K306=\"Over upper limitation\"),\"\",IF(COUNTIF($B306:$J306,L$5),\"✔\",\"\"))","v":""},"","","","","","","","","","","","","","","","","","","","","","","","","",""]
[null,20,"+",20,"+",20,"+",71,"+",71,"Over upper limitation","","","","","","","","","","","","","","","","","","","","","","","","","","",""]
[null,20,"+",20,"+",20,"+",71,"+",80,"Over upper limitation","","","","","","","","","","","","","","","","","","","","","","","","","","",""]
[null,20,"+",20,"+",20,"+",80,"+",80,{"$f":"IF(SUM(B309,D309,F309,H309,J309)<90,\"Under lower limitation\",IF(SUM(B309,D309,F309,H309,J309)>160,\"Over upper limitation\",SUM(B309,D309,F309,H309,J309)))","v":"Over upper limitation"},"","","","","","","","","","","","","","","","","","","","","","","","","","",""]
[null,20,"+",20,"+",25,"+",25,"+",25,115,"✔","✔","","","","","","✔","✔","","","✔",{"$f":"IF(OR($K310=\"Under lower limitation\",$K310=\"Over upper limitation\"),\"\",IF(COUNTIF($B310:$J310,X$5),\"✔\",\"\"))","v":"✔"},"","✔","","","","✔","","","✔","","","","",""]
[null,20,"+",20,"+",25,"+",25,"+",35,125,{"$f":"IF(OR($K311=\"Under lower limitation\",$K311=\"Over upper limitation\"),\"\",IF(COUNTIF($B311:$J311,L$5),\"✔\",\"\"))","v":"✔"},"✔","✔","","","","","✔","✔","✔","","✔","✔","✔","✔","✔","","","✔","✔","","✔","✔","","","",""]
[null,20,"+",20,"+",25,"+",25,"+",50,140,"✔","✔","","✔","","","","✔","✔","","✔","✔","✔","","✔","","✔","","✔","","✔","✔","","✔","","✔","✔"]
[null,20,"+",20,"+",25,"+",25,"+",60,150,"✔","✔","","","✔","","","✔","✔","","","✔","✔","","✔","","","✔","✔","","","✔","","","✔","",""]
[null,20,"+",20,"+",25,"+",25,"+",71,"Over upper limitation","","","","","","","","","","","","","","","","","","","","","","","","","","",""]
[null,20,"+",20,"+",25,"+",25,"+",80,{"$f":"IF(SUM(B315,D315,F315,H315,J315)<90,\"Under lower limitation\",IF(SUM(B315,D315,F315,H315,J315)>160,\"Over upper limitation\",SUM(B315,D315,F315,H315,J315)))","v":"Over upper limitation"},{"$f":"IF(OR($K315=\"Under lower limitation\",$K315=\"Over upper limitation\"),\"\",IF(COUNTIF($B315:$J315,L$5),\"✔\",\"\"))","v":""},"","","","","","","","","","","","","","","","","","","","","","","","","",""]
[null,20,"+",20,"+",25,"+",35,"+",35,135,"✔","✔","✔","","","","","✔","✔","✔","","✔","✔","✔","✔","✔","","","✔","✔","","✔","✔","","","",""]
[null,20,"+",20,"+",25,"+",35,"+",50,150,"✔","✔","✔","✔","","","","✔","✔","✔","✔","✔","✔","✔","✔","✔","✔","","✔","✔","✔","✔","✔","✔","","✔","✔"]
[null,20,"+",20,"+",25,"+",35,"+",60,160,"✔","✔","✔","","✔","","","✔","✔","✔","","✔","✔","✔","✔","✔","","✔","✔","✔","","✔","✔","","✔","",""]
[null,20,"+",20,"+",25,"+",35,"+",71,"Over upper limitation","","","","","","","","","","","","","","","","","","","","","","","","","","",""]
[null,20,"+",20,"+",25,"+",35,"+",80,{"$f":"IF(SUM(B320,D320,F320,H320,J320)<90,\"Under lower limitation\",IF(SUM(B320,D320,F320,H320,J320)>160,\"Over upper limitation\",SUM(B320,D320,F320,H320,J320)))","v":"Over upper limitation"},{"$f":"IF(OR($K320=\"Under lower limitation\",$K320=\"Over upper limitation\"),\"\",IF(COUNTIF($B320:$J320,L$5),\"✔\",\"\"))","v":""},"","","","","","","","","","","","","","","","","","","","","","","","","",""]
[null,20,"+",20,"+",25,"+",50,"+",50,"Over upper limitation","","","","","","","","","","","","","","","","","","","","","","","","","","",""]
[null,20,"+",20,"+",25,"+",50,"+",60,"Over upper limitation","","","","","","","","","","","","",{"$f":"IF(OR($K322=\"Under lower limitation\",$K322=\"Over upper limitation\"),\"\",IF(COUNTIF($B322:$J322,X$5),\"✔\",\"\"))","v":""},"","","","","","","","","","","","","",""]
[null,20,"+",20,"+",25,"+",50,"+",71,"Over upper limitation",{"$f":"IF(OR($K323=\"Under lower limitation\",$K323=\"Over upper limitation\"),\"\",IF(COUNTIF($B323:$J323,L$5),\"✔\",\"\"))","v":""},"","","","","","","","","","","","","","","","","","","","","","","","","",""]
[null,20,"+",20,"+",25,"+",50,"+",80,{"$f":"IF(SUM(B324,D324,F324,H324,J324)<90,\"Under lower limitation\",IF(SUM(B324,D324,F324,H324,J324)>160,\"Over upper limitation\",SUM(B324,D324,F324,H324,J324)))","v":"Over upper limitation"},{"$f":"IF(OR($K324=\"Under lower limitation\",$K324=\"Over upper limitation\"),\"\",IF(COUNTIF($B324:$J324,L$5),\"✔\",\"\"))","v":""},"","","","","","","","","","","","","","","","","","","","","","","","","",""]
[null,20,"+",20,"+",25,"+",60,"+",60,"Over upper limitation","","","","","","","","","","","","","","","","","","","","","","","","","","",""]
[null,20,"+",20,"+",25,"+",60,"+",71,"Over upper limitation","","","","","","","","","","","","","","","","","","","","","","","","","","",""]
[null,20,"+",20,"+",25,"+",60,"+",80,{"$f":"IF(SUM(B327,D327,F327,H327,J327)<90,\"Under lower limitation\",IF(SUM(B327,D327,F327,H327,J327)>160,\"Over upper limitation\",SUM(B327,D327,F327,H327,J327)))","v":"Over upper limitation"},{"$f":"IF(OR($K327=\"Under lower limitation\",$K327=\"Over upper limitation\"),\"\",IF(COUNTIF($B327:$J327,L$5),\"✔\",\"\"))","v":""},"","","","","","","","","","","","","","","","","","","","","","","","","",""]
[null,20,"+",20,"+",25,"+",71,"+",71,"Over upper limitation","","","","","","","","","","","","","","","","","","","","","","","","","","",""]
[null,20,"+",20,"+",25,"+",71,"+",80,"Over upper limitation","","","","","","","","","","","","","","","","","","","","","","","","","","",""]
[null,20,"+",20,"+",25,"+",80,"+",80,{"$f":"IF(SUM(B330,D330,F330,H330,J330)<90,\"Under lower limitation\",IF(SUM(B330,D330,F330,H330,J330)>160,\"Over upper limitation\",SUM(B330,D330,F330,H330,J330)))","v":"Over upper limitation"},"","","","","","","","","","","","","","","","","","","","","","","","","","",""]
[null,20,"+",20,"+",35,"+",35,"+",35,145,"✔","","✔","","","","","✔","","✔","","✔","","✔","","✔","","","","✔","","","✔","","","",""]
[null,20,"+",20,"+",35,"+",35,"+",50,160,"✔","","✔","✔","","","","✔","","✔","✔","✔","","✔","","✔","✔","","","✔","✔","","✔","✔","","✔","✔"]
[null,20,"+",20,"+",35,"+",35,"+",60,"Over upper limitation","","","","","","","","","","","","","","","","","","","","","","","","","","",""]
[null,20,"+",20,"+",35,"+",35,"+",71,"Over upper limitation","","","","","","","","","","","","","","","","","","","","","","","","","","",""]
[null,20,"+",20,"+",35,"+",35,"+",80,{"$f":"IF(SUM(B335,D335,F335,H335,J335)<90,\"Under lower limitation\",IF(SUM(B335,D335,F335,H335,J335)>160,\"Over upper limitation\",SUM(B335,D335,F335,H335,J335)))","v":"Over upper limitation"},{"$f":"IF(OR($K335=\"Under lower limitation\",$K335=\"Over upper limitation\"),\"\",IF(COUNTIF($B335:$J335,L$5),\"✔\",\"\"))","v":""},"","","","","","","","","","","","","","","","","","","","","","","","","",""]
[null,20,"+",20,"+",35,"+",50,"+",50,"Over upper limitation","","","","","","","","","","","","","","","","","","","","","","","","","","",""]
[null,20,"+",20,"+",35,"+",50,"+",60,"Over upper limitation","","","","","","","","","","","","",{"$f":"IF(OR($K337=\"Under lower limitation\",$K337=\"Over upper limitation\"),\"\",IF(COUNTIF($B337:$J337,X$5),\"✔\",\"\"))","v":""},"","","","","","","","","","","","","",""]
[null,20,"+",20,"+",35,"+",50,"+",71,{"$f":"IF(SUM(B338,D338,F338,H338,J338)<90,\"Under lower limitation\",IF(SUM(B338,D338,F338,H338,J338)>160,\"Over upper limitation\",SUM(B338,D338,F338,H338,J338)))","v":"Over upper limitation"},{"$f":"IF(OR($K338=\"Under lower limitation\",$K338=\"Over upper limitation\"),\"\",IF(COUNTIF($B338:$J338,L$5),\"✔\",\"\"))","v":""},"","","","","","","","","","","","","","","","","","","","","","","","","",""]
[null,20,"+",20,"+",35,"+",50,"+",80,"Over upper limitation","","","","","","","","","","","","","","","","","","","","","","","","","","",""]
[null,20,"+",20,"+",35,"+",60,"+",60,"Over upper limitation",{"$f":"IF(OR($K340=\"Under lower limitation\",$K340=\"Over upper limitation\"),\"\",IF(COUNTIF($B340:$J340,L$5),\"✔\",\"\"))","v":""},"","","","","","","","","","","","","","","","","","","","","","","","","",""]
[null,20,"+",20,"+",35,"+",60,"+",71,"Over upper limitation","","","","","","","","","","","","","","","","","","","","","","","","","","",""]
[null,20,"+",20,"+",35,"+",60,"+",80,{"$f":"IF(SUM(B342,D342,F342,H342,J342)<90,\"Under lower limitation\",IF(SUM(B342,D342,F342,H342,J342)>160,\"Over upper limitation\",SUM(B342,D342,F342,H342,J342)))","v":"Over upper limitation"},{"$f":"IF(OR($K342=\"Under lower limitation\",$K342=\"Over upper limitation\"),\"\",IF(COUNTIF($B342:$J342,L$5),\"✔\",\"\"))","v":""},"","","","","","","","","","","","","","","","","","","","","","","","","",""]
[null,20,"+",20,"+",35,"+",71,"+",71,"Over upper limitation","","","","","","","","","","","","","","","","","","","","","","","","","","",""]
[null,20,"+",20,"+",35,"+",71,"+",80,{"$f":"IF(SUM(B344,D344,F344,H344,J344)<90,\"Under lower limitation\",IF(SUM(B344,D344,F344,H344,J344)>160,\"Over upper limitation\",SUM(B344,D344,F344,H344,J344)))","v":"Over upper limitation"},"","","","","","","","","","","","","","","","","","","","","","","","","","",""]
[null,20,"+",20,"+",35,"+",80,"+",80,{"$f":"IF(SUM(B345,D345,F345,H345,J345)<90,\"Under lower limitation\",IF(SUM(B345,D345,F345,H345,J345)>160,\"Over upper limitation\",SUM(B345,D345,F345,H345,J345)))","v":"Over upper limitation"},"","","","","","","","","","","","","","","","","","","","","","","","","","",""]
[null,20,"+",20,"+",50,"+",50,"+",50,"Over upper limitation","","","","","","","","","","","","","","","","","","","","","","","","","","",""]
[null,20,"+",20,"+",50,"+",50,"+",60,"Over upper limitation","","","","","","","","","","","","","","","","","","","","","","","","","","",""]
[null,20,"+",20,"+",50,"+",50,"+",71,"Over upper limitation","","","","","","","","","","","","","","","","","","","","","","","","","","",""]
[null,20,"+",20,"+",50,"+",50,"+",80,{"$f":"IF(SUM(B349,D349,F349,H349,J349)<90,\"Under lower limitation\",IF(SUM(B349,D349,F349,H349,J349)>160,\"Over upper limitation\",SUM(B349,D349,F349,H349,J349)))","v":"Over upper limitation"},{"$f":"IF(OR($K349=\"Under lower limitation\",$K349=\"Over upper limitation\"),\"\",IF(COUNTIF($B349:$J349,L$5),\"✔\",\"\"))","v":""},"","","","","","","","","","","","","","","","","","","","","","","","","",""]
[null,20,"+",20,"+",50,"+",60,"+",60,"Over upper limitation","","","","","","","","","","","","","","","","","","","","","","","","","","",""]
[null,20,"+",20,"+",50,"+",60,"+",71,"Over upper limitation","","","","","","","","","","","","","","","","","","","","","","","","","","",""]
[null,20,"+",20,"+",50,"+",60,"+",80,{"$f":"IF(SUM(B352,D352,F352,H352,J352)<90,\"Under lower limitation\",IF(SUM(B352,D352,F352,H352,J352)>160,\"Over upper limitation\",SUM(B352,D352,F352,H352,J352)))","v":"Over upper limitation"},{"$f":"IF(OR($K352=\"Under lower limitation\",$K352=\"Over upper limitation\"),\"\",IF(COUNTIF($B352:$J352,L$5),\"✔\",\"\"))","v":""},"","","","","","","","","","","","","","","","","","","","","","","","","",""]
[null,20,"+",20,"+",50,"+",71,"+",71,"Over upper limitation","","","","","","","","","","","","","","","","","","","","","","","","","","",""]
[null,20,"+",20,"+",50,"+",71,"+",80,{"$f":"IF(SUM(B354,D354,F354,H354,J354)<90,\"Under lower limitation\",IF(SUM(B354,D354,F354,H354,J354)>160,\"Over upper limitation\",SUM(B354,D354,F354,H354,J354)))","v":"Over upper limitation"},"","","","","","","","","","","","","","","","","","","","","","","","","","",""]
[null,20,"+",20,"+",50,"+",80,"+",80,{"$f":"IF(SUM(B355,D355,F355,H355,J355)<90,\"Under lower limitation\",IF(SUM(B355,D355,F355,H355,J355)>160,\"Over upper limitation\",SUM(B355,D355,F355,H355,J355)))","v":"Over upper limitation"},"","","","","","","","","","","","","","","","","","","","","","","","","","",""]
[null,20,"+",20,"+",60,"+",60,"+",60,"Over upper limitation","","","","","","","","","","","","","","","","","","","","","","","","","","",""]
[null,20,"+",20,"+",60,"+",60,"+",71,"Over upper limitation","","","","","","","","","","","","","","","","","","","","","","","","","","",""]
[null,20,"+",20,"+",60,"+",60,"+",80,{"$f":"IF(SUM(B358,D358,F358,H358,J358)<90,\"Under lower limitation\",IF(SUM(B358,D358,F358,H358,J358)>160,\"Over upper limitation\",SUM(B358,D358,F358,H358,J358)))","v":"Over upper limitation"},{"$f":"IF(OR($K358=\"Under lower limitation\",$K358=\"Over upper limitation\"),\"\",IF(COUNTIF($B358:$J358,L$5),\"✔\",\"\"))","v":""},"","","","","","","","","","","","","","","","","","","","","","","","","",""]
[null,20,"+",20,"+",60,"+",71,"+",71,"Over upper limitation","","","","","","","","","","","","",{"$f":"IF(OR($K359=\"Under lower limitation\",$K359=\"Over upper limitation\"),\"\",IF(COUNTIF($B359:$J359,X$5),\"✔\",\"\"))","v":""},"","","","","","","","","","","","","",""]
[null,20,"+",20,"+",60,"+",71,"+",80,{"$f":"IF(SUM(B360,D360,F360,H360,J360)<90,\"Under lower limitation\",IF(SUM(B360,D360,F360,H360,J360)>160,\"Over upper limitation\",SUM(B360,D360,F360,H360,J360)))","v":"Over upper limitation"},{"$f":"IF(OR($K360=\"Under lower limitation\",$K360=\"Over upper limitation\"),\"\",IF(COUNTIF($B360:$J360,L$5),\"✔\",\"\"))","v":""},"","","","","","","","","","","","","","","","","","","","","","","","","",""]
[null,20,"+",20,"+",71,"+",80,"+",80,"Over upper limitation",{"$f":"IF(OR($K361=\"Under lower limitation\",$K361=\"Over upper limitation\"),\"\",IF(COUNTIF($B361:$J361,L$5),\"✔\",\"\"))","v":""},"","","","","","","","","","","","","","","","","","","","","","","","","",""]
[null,20,"+",20,"+",80,"+",80,"+",80,{"$f":"IF(SUM(B362,D362,F362,H362,J362)<90,\"Under lower limitation\",IF(SUM(B362,D362,F362,H362,J362)>160,\"Over upper limitation\",SUM(B362,D362,F362,H362,J362)))","v":"Over upper limitation"},{"$f":"IF(OR($K362=\"Under lower limitation\",$K362=\"Over upper limitation\"),\"\",IF(COUNTIF($B362:$J362,L$5),\"✔\",\"\"))","v":""},"","","","","","","","","","","","","","","","","","","","","","","","","",""]
[null,20,"+",25,"+",25,"+",25,"+",35,130,"✔","✔","✔","","","","","✔","✔","✔","","✔","✔","✔","✔","✔","","","✔","✔","","✔","✔","","","",""]
[null,20,"+",25,"+",25,"+",25,"+",50,145,"✔","✔","","✔","","","","✔","✔","","✔","✔","✔","","✔","","✔","","✔","","✔","✔","","✔","","✔","✔"]
[null,20,"+",25,"+",25,"+",25,"+",60,155,"✔","✔","","","✔","","","✔","✔","","","✔","✔","","✔","","","✔","✔","","","✔","","","✔","",""]
[null,20,"+",25,"+",25,"+",25,"+",71,"Over upper limitation","","","","","","","","","","","","","","","","","","","","","","","","","","",""]
[null,20,"+",25,"+",25,"+",25,"+",80,{"$f":"IF(SUM(B367,D367,F367,H367,J367)<90,\"Under lower limitation\",IF(SUM(B367,D367,F367,H367,J367)>160,\"Over upper limitation\",SUM(B367,D367,F367,H367,J367)))","v":"Over upper limitation"},{"$f":"IF(OR($K367=\"Under lower limitation\",$K367=\"Over upper limitation\"),\"\",IF(COUNTIF($B367:$J367,L$5),\"✔\",\"\"))","v":""},"","","","","","","","","","","","","","","","","","","","","","","","","",""]
[null,20,"+",25,"+",25,"+",35,"+",35,140,"✔","✔","✔","","","","","✔","✔","✔","","✔","✔","✔","✔","✔","","","✔","✔","","✔","✔","","","",""]
[null,20,"+",25,"+",25,"+",35,"+",50,155,"✔","✔","✔","✔","","","","✔","✔","✔","✔","✔","✔","✔","✔","✔","✔","","✔","✔","✔","✔","✔","✔","","✔","✔"]
[null,20,"+",25,"+",25,"+",35,"+",60,"Over upper limitation","","","","","","","","","","","","","","","","","","","","","","","","","","",""]
[null,20,"+",25,"+",25,"+",35,"+",71,"Over upper limitation","","","","","","","","","","","","","","","","","","","","","","","","","","",""]
[null,20,"+",25,"+",25,"+",35,"+",80,{"$f":"IF(SUM(B372,D372,F372,H372,J372)<90,\"Under lower limitation\",IF(SUM(B372,D372,F372,H372,J372)>160,\"Over upper limitation\",SUM(B372,D372,F372,H372,J372)))","v":"Over upper limitation"},{"$f":"IF(OR($K372=\"Under lower limitation\",$K372=\"Over upper limitation\"),\"\",IF(COUNTIF($B372:$J372,L$5),\"✔\",\"\"))","v":""},"","","","","","","","","","","","","","","","","","","","","","","","","",""]
[null,20,"+",25,"+",25,"+",50,"+",50,"Over upper limitation","","","","","","","","","","","","",{"$f":"IF(OR($K373=\"Under lower limitation\",$K373=\"Over upper limitation\"),\"\",IF(COUNTIF($B373:$J373,X$5),\"✔\",\"\"))","v":""},"","","","","","","","","","","","","",""]
[null,20,"+",25,"+",25,"+",50,"+",60,"Over upper limitation",{"$f":"IF(OR($K374=\"Under lower limitation\",$K374=\"Over upper limitation\"),\"\",IF(COUNTIF($B374:$J374,L$5),\"✔\",\"\"))","v":""},"","","","","","","","","","","","","","","","","","","","","","","","","",""]
[null,20,"+",25,"+",25,"+",50,"+",71,"Over upper limitation","","","","","","","","","","","","","","","","","","","","","","","","","","",""]
[null,20,"+",25,"+",25,"+",50,"+",80,{"$f":"IF(SUM(B376,D376,F376,H376,J376)<90,\"Under lower limitation\",IF(SUM(B376,D376,F376,H376,J376)>160,\"Over upper limitation\",SUM(B376,D376,F376,H376,J376)))","v":"Over upper limitation"},{"$f":"IF(OR($K376=\"Under lower limitation\",$K376=\"Over upper limitation\"),\"\",IF(COUNTIF($B376:$J376,L$5),\"✔\",\"\"))","v":""},"","","","","","","","","","","","","","","","","","","","","","","","","",""]
[null,20,"+",25,"+",25,"+",60,"+",60,"Over upper limitation","","","","","","","","","","","","","","","","","","","","","","","","","","",""]
[null,20,"+",25,"+",25,"+",60,"+",71,"Over upper limitation","","","","","","","","","","","","","","","","","","","","","","","","","","",""]
[null,20,"+",25,"+",25,"+",60,"+",80,{"$f":"IF(SUM(B379,D379,F379,H379,J379)<90,\"Under lower limitation\",IF(SUM(B379,D379,F379,H379,J379)>160,\"Over upper limitation\",SUM(B379,D379,F379,H379,J379)))","v":"Over upper limitation"},{"$f":"IF(OR($K379=\"Under lower limitation\",$K379=\"Over upper limitation\"),\"\",IF(COUNTIF($B379:$J379,L$5),\"✔\",\"\"))","v":""},"","","","","","","","","","","","","","","","","","","","","","","","","",""]
[null,20,"+",25,"+",25,"+",71,"+",71,"Over upper limitation","","","","","","","","","","","","","","","","","","","","","","","","","","",""]
[null,20,"+",25,"+",25,"+",71,"+",80,{"$f":"IF(SUM(B381,D381,F381,H381,J381)<90,\"Under lower limitation\",IF(SUM(B381,D381,F381,H381,J381)>160,\"Over upper limitation\",SUM(B381,D381,F381,H381,J381)))","v":"Over upper limitation"},{"$f":"IF(OR($K381=\"Under lower limitation\",$K381=\"Over upper limitation\"),\"\",IF(COUNTIF($B381:$J381,L$5),\"✔\",\"\"))","v":""},"","","","","","","","","","","","","","","","","","","","","","","","","",""]
[null,20,"+",25,"+",25,"+",80,"+",80,{"$f":"IF(SUM(B382,D382,F382,H382,J382)<90,\"Under lower limitation\",IF(SUM(B382,D382,F382,H382,J382)>160,\"Over upper limitation\",SUM(B382,D382,F382,H382,J382)))","v":"Over upper limitation"},"","","","","","","","","","","","","","","","","","","","","","","","","","",""]
[null,20,"+",25,"+",35,"+",35,"+",35,{"$f":"IF(SUM(B383,D383,F383,H383,J383)<90,\"Under lower limitation\",IF(SUM(B383,D383,F383,H383,J383)>160,\"Over upper limitation\",SUM(B383,D383,F383,H383,J383)))","v":150},"✔","✔","✔","","","","","✔","✔","✔","","✔","✔","✔","✔","✔","","","✔","✔","","✔","✔","","","",""]
[null,20,"+",25,"+",35,"+",35,"+",50,"Over upper limitation","","","","","","","","","","","","","","","","","","","","","","","","","","",""]
[null,20,"+",25,"+",35,"+",35,"+",60,"Over upper limitation","","","","","","","","","","","","","","","","","","","","","","","","","","",""]
[null,20,"+",25,"+",35,"+",35,"+",71,"Over upper limitation","","","","","","","","","","","","","","","","","","","","","","","","","","",""]
[null,20,"+",25,"+",35,"+",35,"+",80,{"$f":"IF(SUM(B387,D387,F387,H387,J387)<90,\"Under lower limitation\",IF(SUM(B387,D387,F387,H387,J387)>160,\"Over upper limitation\",SUM(B387,D387,F387,H387,J387)))","v":"Over upper limitation"},{"$f":"IF(OR($K387=\"Under lower limitation\",$K387=\"Over upper limitation\"),\"\",IF(COUNTIF($B387:$J387,L$5),\"✔\",\"\"))","v":""},"","","","","","","","","","","","","","","","","","","","","","","","","",""]
[null,20,"+",25,"+",35,"+",50,"+",50,"Over upper limitation","","","","","","","","","","","","",{"$f":"IF(OR($K388=\"Under lower limitation\",$K388=\"Over upper limitation\"),\"\",IF(COUNTIF($B388:$J388,X$5),\"✔\",\"\"))","v":""},"","","","","","","","","","","","","",""]
[null,20,"+",25,"+",35,"+",50,"+",60,"Over upper limitation",{"$f":"IF(OR($K389=\"Under lower limitation\",$K389=\"Over upper limitation\"),\"\",IF(COUNTIF($B389:$J389,L$5),\"✔\",\"\"))","v":""},"","","","","","","","","","","","","","","","","","","","","","","","","",""]
[null,20,"+",25,"+",35,"+",50,"+",71,"Over upper limitation","","","","","","","","","","","","","","","","","","","","","","","","","","",""]
[null,20,"+",25,"+",35,"+",50,"+",80,{"$f":"IF(SUM(B391,D391,F391,H391,J391)<90,\"Under lower limitation\",IF(SUM(B391,D391,F391,H391,J391)>160,\"Over upper limitation\",SUM(B391,D391,F391,H391,J391)))","v":"Over upper limitation"},{"$f":"IF(OR($K391=\"Under lower limitation\",$K391=\"Over upper limitation\"),\"\",IF(COUNTIF($B391:$J391,L$5),\"✔\",\"\"))","v":""},"","","","","","","","","","","","","","","","","","","","","","","","","",""]
[null,20,"+",25,"+",35,"+",60,"+",60,{"$f":"IF(SUM(B392,D392,F392,H392,J392)<90,\"Under lower limitation\",IF(SUM(B392,D392,F392,H392,J392)>160,\"Over upper limitation\",SUM(B392,D392,F392,H392,J392)))","v":"Over upper limitation"},"","","","","","","","","","","","","","","","","","","","","","","","","","",""]
[null,20,"+",25,"+",35,"+",60,"+",71,"Over upper limitation","","","","","","","","","","","","","","","","","","","","","","","","","","",""]
[null,20,"+",25,"+",35,"+",60,"+",80,"Over upper limitation","","","","","","","","","","","","","","","","","","","","","","","","","","",""]
[null,20,"+",25,"+",35,"+",71,"+",71,{"$f":"IF(SUM(B395,D395,F395,H395,J395)<90,\"Under lower limitation\",IF(SUM(B395,D395,F395,H395,J395)>160,\"Over upper limitation\",SUM(B395,D395,F395,H395,J395)))","v":"Over upper limitation"},"","","","","","","","","","","","","","","","","","","","","","","","","","",""]
[null,20,"+",25,"+",35,"+",71,"+",80,"Over upper limitation","","","","","","","","","","","","","","","","","","","","","","","","","","",""]
[null,20,"+",25,"+",35,"+",80,"+",80,{"$f":"IF(SUM(B397,D397,F397,H397,J397)<90,\"Under lower limitation\",IF(SUM(B397,D397,F397,H397,J397)>160,\"Over upper limitation\",SUM(B397,D397,F397,H397,J397)))","v":"Over upper limitation"},"","","","","","","","","","","","","","","","","","","","","","","","","","",""]
[null,20,"+",25,"+",50,"+",50,"+",50,"Over upper limitation","","","","","","","","","","","","","","","","","","","","","","","","","","",""]
[null,20,"+",25,"+",50,"+",50,"+",60,"Over upper limitation","","","","","","","","","","","","","","","","","","","","","","","","","","",""]
[null,20,"+",25,"+",50,"+",50,"+",71,"Over upper limitation","","","","","","","","","","","","","","","","","","","","","","","","","","",""]
[null,20,"+",25,"+",50,"+",50,"+",80,{"$f":"IF(SUM(B401,D401,F401,H401,J401)<90,\"Under lower limitation\",IF(SUM(B401,D401,F401,H401,J401)>160,\"Over upper limitation\",SUM(B401,D401,F401,H401,J401)))","v":"Over upper limitation"},{"$f":"IF(OR($K401=\"Under lower limitation\",$K401=\"Over upper limitation\"),\"\",IF(COUNTIF($B401:$J401,L$5),\"✔\",\"\"))","v":""},"","","","","","","","","","","","","","","","","","","","","","","","","",""]
[null,20,"+",25,"+",50,"+",60,"+",60,"Over upper limitation","","","","","","","","","","","","","","","","","","","","","","","","","","",""]
[null,20,"+",25,"+",50,"+",60,"+",71,"Over upper limitation","","","","","","","","","","","","","","","","","","","","","","","","","","",""]
[null,20,"+",25,"+",50,"+",60,"+",80,{"$f":"IF(SUM(B404,D404,F404,H404,J404)<90,\"Under lower limitation\",IF(SUM(B404,D404,F404,H404,J404)>160,\"Over upper limitation\",SUM(B404,D404,F404,H404,J404)))","v":"Over upper limitation"},{"$f":"IF(OR($K404=\"Under lower limitation\",$K404=\"Over upper limitation\"),\"\",IF(COUNTIF($B404:$J404,L$5),\"✔\",\"\"))","v":""},"","","","","","","","","","","","","","","","","","","","","","","","","",""]
[null,20,"+",25,"+",50,"+",71,"+",71,"Over upper limitation","","","","","","","","","","","","","","","","","","","","","","","","","","",""]
[null,20,"+",25,"+",50,"+",71,"+",80,{"$f":"IF(SUM(B406,D406,F406,H406,J406)<90,\"Under lower limitation\",IF(SUM(B406,D406,F406,H406,J406)>160,\"Over upper limitation\",SUM(B406,D406,F406,H406,J406)))","v":"Over upper limitation"},"","","","","","","","","","","","","","","","","","","","","","","","","","",""]
[null,20,"+",25,"+",50,"+",80,"+",80,{"$f":"IF(SUM(B407,D407,F407,H407,J407)<90,\"Under lower limitation\",IF(SUM(B407,D407,F407,H407,J407)>160,\"Over upper limitation\",SUM(B407,D407,F407,H407,J407)))","v":"Over upper limitation"},"","","","","","","","","","","","","","","","","","","","","","","","","","",""]
[null,20,"+",25,"+",60,"+",60,"+",60,"Over upper limitation","","","","","","","","","","","","","","","","","","","","","","","","","","",""]
[null,20,"+",25,"+",60,"+",60,"+",71,"Over upper limitation","","","","","","","","","","","","","","","","","","","","","","","","","","",""]
[null,20,"+",25,"+",60,"+",71,"+",71,"Over upper limitation","","","","","","","","","","","","",{"$f":"IF(OR($K410=\"Under lower limitation\",$K410=\"Over upper limitation\"),\"\",IF(COUNTIF($B410:$J410,X$5),\"✔\",\"\"))","v":""},"","","","","","","","","","","","","",""]
[null,20,"+",25,"+",60,"+",71,"+",80,{"$f":"IF(SUM(B411,D411,F411,H411,J411)<90,\"Under lower limitation\",IF(SUM(B411,D411,F411,H411,J411)>160,\"Over upper limitation\",SUM(B411,D411,F411,H411,J411)))","v":"Over upper limitation"},{"$f":"IF(OR($K411=\"Under lower limitation\",$K411=\"Over upper limitation\"),\"\",IF(COUNTIF($B411:$J411,L$5),\"✔\",\"\"))","v":""},"","","","","","","","","","","","","","","","","","","","","","","","","",""]
[null,20,"+",25,"+",60,"+",80,"+",80,{"$f":"IF(SUM(B412,D412,F412,H412,J412)<90,\"Under lower limitation\",IF(SUM(B412,D412,F412,H412,J412)>160,\"Over upper limitation\",SUM(B412,D412,F412,H412,J412)))","v":"Over upper limitation"},"","","","","","","","","","","","","","","","","","","","","","","","","","",""]
[null,20,"+",25,"+",71,"+",71,"+",71,"Over upper limitation",{"$f":"IF(OR($K413=\"Under lower limitation\",$K413=\"Over upper limitation\"),\"\",IF(COUNTIF($B413:$J413,L$5),\"✔\",\"\"))","v":""},"","","","","","","","","","","","","","","","","","","","","","","","","",""]
[null,20,"+",25,"+",71,"+",71,"+",80,{"$f":"IF(SUM(B414,D414,F414,H414,J414)<90,\"Under lower limitation\",IF(SUM(B414,D414,F414,H414,J414)>160,\"Over upper limitation\",SUM(B414,D414,F414,H414,J414)))","v":"Over upper limitation"},{"$f":"IF(OR($K414=\"Under lower limitation\",$K414=\"Over upper limitation\"),\"\",IF(COUNTIF($B414:$J414,L$5),\"✔\",\"\"))","v":""},"","","","","","","","","","","","","","","","","","","","","","","","","",""]
[null,20,"+",25,"+",71,"+",80,"+",80,{"$f":"IF(SUM(B415,D415,F415,H415,J415)<90,\"Under lower limitation\",IF(SUM(B415,D415,F415,H415,J415)>160,\"Over upper limitation\",SUM(B415,D415,F415,H415,J415)))","v":"Over upper limitation"},"","","","","","","","","","","","","","","","","","","","","","","","","","",""]
[null,20,"+",25,"+",80,"+",80,"+",80,{"$f":"IF(SUM(B416,D416,F416,H416,J416)<90,\"Under lower limitation\",IF(SUM(B416,D416,F416,H416,J416)>160,\"Over upper limitation\",SUM(B416,D416,F416,H416,J416)))","v":"Over upper limitation"},"","","","","","","","","","","","","","","","","","","","","","","","","","",""]
[null,20,"+",35,"+",35,"+",35,"+",35,160,"✔","","✔","","","","","✔","","✔","","✔","","✔","","✔","","","","✔","","","✔","","","",""]
[null,20,"+",35,"+",35,"+",35,"+",50,"Over upper limitation","","","","","","","","","","","","","","","","","","","","","","","","","","",""]
[null,20,"+",35,"+",35,"+",35,"+",60,"Over upper limitation","","","","","","","","","","","","","","","","","","","","","","","","","","",""]
[null,20,"+",35,"+",35,"+",35,"+",71,"Over upper limitation","","","","","","","","","","","","","","","","","","","","","","","","","","",""]
[null,20,"+",35,"+",35,"+",35,"+",80,{"$f":"IF(SUM(B421,D421,F421,H421,J421)<90,\"Under lower limitation\",IF(SUM(B421,D421,F421,H421,J421)>160,\"Over upper limitation\",SUM(B421,D421,F421,H421,J421)))","v":"Over upper limitation"},{"$f":"IF(OR($K421=\"Under lower limitation\",$K421=\"Over upper limitation\"),\"\",IF(COUNTIF($B421:$J421,L$5),\"✔\",\"\"))","v":""},"","","","","","","","","","","","","","","","","","","","","","","","","",""]
[null,25,"+",25,"+",25,"+",25,"+",25,125,"","✔","","","","","","","✔","","","","✔","","✔","","","","✔","","","✔","","","","",""]
[null,25,"+",25,"+",25,"+",25,"+",35,135,"","✔","✔","","","","","","✔","✔","","","✔","✔","✔","✔","","","✔","✔","","✔","✔","","","",""]
[null,25,"+",25,"+",25,"+",25,"+",50,150,"","✔","","✔","","","","","✔","","✔","","✔","","✔","","✔","","✔","","✔","✔","","✔","","✔","✔"]
[null,25,"+",25,"+",25,"+",25,"+",60,160,"","✔","","","✔","","","","✔","","","","✔","","✔","","","✔","✔","","","✔","","","✔","",""]
[null,25,"+",25,"+",25,"+",25,"+",71,"Over upper limitation","","","","","","","","","","","","",{"$f":"IF(OR($K426=\"Under lower limitation\",$K426=\"Over upper limitation\"),\"\",IF(COUNTIF($B426:$J426,X$5),\"✔\",\"\"))","v":""},"","","","","","","","","","","","","",""]
[null,25,"+",25,"+",25,"+",25,"+",80,{"$f":"IF(SUM(B427,D427,F427,H427,J427)<90,\"Under lower limitation\",IF(SUM(B427,D427,F427,H427,J427)>160,\"Over upper limitation\",SUM(B427,D427,F427,H427,J427)))","v":"Over upper limitation"},{"$f":"IF(OR($K427=\"Under lower limitation\",$K427=\"Over upper limitation\"),\"\",IF(COUNTIF($B427:$J427,L$5),\"✔\",\"\"))","v":""},"","","","","","","","","","","","","","","","","","","","","","","","","",""]
[null,25,"+",25,"+",25,"+",35,"+",35,145,{"$f":"IF(OR($K428=\"Under lower limitation\",$K428=\"Over upper limitation\"),\"\",IF(COUNTIF($B428:$J428,L$5),\"✔\",\"\"))","v":""},"✔","✔","","","","","","✔","✔","","","✔","✔","✔","✔","","","✔","✔","","✔","✔","","","",""]
[null,25,"+",25,"+",25,"+",35,"+",50,160,"","✔","✔","✔","","","","","✔","✔","✔","","✔","✔","✔","✔","✔","","✔","✔","✔","✔","✔","✔","","✔","✔"]
[null,25,"+",25,"+",25,"+",35,"+",60,"Over upper limitation","","","","","","","","","","","","","","","","","","","","","","","","","","",""]
[null,25,"+",25,"+",25,"+",50,"+",50,"Over upper limitation","","","","","","","","","","","","","","","","","","","","","","","","","","",""]
[null,25,"+",25,"+",25,"+",60,"+",60,"Over upper limitation","","","","","","","","","","","","","","","","","","","","","","","","","","",""]
[null,25,"+",25,"+",35,"+",35,"+",35,155,"","✔","✔","","","","","","✔","✔","","","✔","✔","✔","✔","","","✔","✔","","✔","✔","","","",""]